{"text_format":"1","workbook":"xlsx","n_sheets":5,"sheets":["Anleitung","Musterschließanlagen","Schließplan","Artikelliste","Systemaufstellung"],"not_rendered":{"charts":0,"images":44,"macros":1,"external_links":0,"defined_names":10,"comments":2,"pivot_tables":0},"unopened":[],"bounds":{"document_bytes":16777216,"sheet_cells":100000,"rows_first":2000,"rows_last":500,"rows_between":2000,"halvings":0,"cell_chars":16384,"cell_head_chars":4096},"cells_cut":0,"cells_raw":0,"read":"whole","date_system":"1900"}

{"sheet":"Anleitung","index":0,"n_rows":448,"n_cols":6,"rows_kept":448,"cut":false,"hidden":false,"merged":[[0,0,0,7],[7,0,7,7],[8,0,8,7],[18,0,18,7]]}
["W   I   L   K   A       -       V   O   R   S   P   R   U   N   G       D  U   R   C   H       Q   U   A   L   I   T   Ä   T"]
[]
[]
[]
[]
[]
[]
["WILKA-Schließplan - Erfassung im Excel-Format"]
["Anleitung"]
[]
[]
["Der WILKA-Excel-Schließplan ist mit vielen Funktionen ausgestattet, die Ihnen das Erstellen eines Schließplanes"]
["vereinfachern sollen."]
[]
["Auf den nachstehenden Seiten erhalten Sie eine Übersicht über die Funktionen des WILKA-Excel-Schließplanes."]
[]
["Bei Fragen oder Anregungen zu dem Excelschließplan senden Sie uns bitte eine E-Mail an:"]
[]
["schliessanlagen@wilka.de"]
[]
[]
[null,"Inhaltsverzeichnis"]
[]
[]
[null,"Einleitung",null,null,null,"Seite   1"]
[null,"1. Musterschließanlagen",null,null,null,"Seite   1"]
[null,"2. Schließplan",null,null,null,"Seite   2"]
[null,"    2.1 Systemauswahl",null,null,null,"Seite   3"]
[null,"    2.2 Anlagenart",null,null,null,"Seite   3"]
[null,"    2.3 Artikelauswahl",null,null,null,"Seite   4"]
[null,"    2.4 Färbungen und Sonderausstattungen",null,null,null,"Seite   5"]
[null,"3. Artikelliste",null,null,null,"Seite   6"]
[null,"4. Massenermittlung",null,null,null,"Seite   7"]
[null,"    4.1 Massenermittlung als Angebotsformular",null,null,null,"Seite   9"]
[null,"5. Sonderfunktion mit Makro",null,null,null,"Seite 10"]
[null,"    5.1 Markierten Bereich drucken",null,null,null,"Seite 10"]
[null,"    5.2 Schließplanversand per E-Mail",null,null,null,"Seite 11"]
[]
[]
[]
[]
[]
[]
[]
[]
[]
[]
[]
[]
[]
[]
[]
[]
[]
[]
[]
[]
[]
[]
["Einleitung"]
[]
["Der WILKA-Excel-Schließplan dient zur Erfassung Ihres Schließplanes mit allen in Excel vorhandenen"]
["Funktionen. Sie haben hier die Möglichkeit fünf Tabellen mit besonderen Features auszuwählen."]
["Die einzelnen Tabellen erreichen Sie durch Auswahl eines Karteireiters im unteren Teil des Bildschirmes."]
[]
[]
[]
[]
[]
["1. Musterschließanlagen"]
[]
["Für jede gängige Schließanlagenart haben wir eine Musterschließanlage hinterlegt. Durch Klick des Dropdown-Pfeiles"]
["öffnet sich eine Auswahl aller vorhandenen Schließanlagenarten."]
[]
[]
[]
[]
[]
[]
[]
[]
[]
[]
[]
[]
[]
[]
[]
[]
[]
[]
[]
[]
[]
[]
[]
[]
[]
[]
[]
[]
[]
[]
[]
[]
[]
[]
[]
["Nach Auswahl einer Schließanlagenart wird Ihnen eine entsprechende Musterschließanlage angezeigt."]
["Hier können Sie die Schreibweise von übergeordneten Schlüsseln und Zentral- bzw. Mitschließungsfunktionen"]
["entnehmen."]
[]
[]
[]
[]
[]
[]
[]
[]
[]
[]
[]
[]
[]
[]
[]
[]
["2. Schließplan"]
[]
["Der WILKA-Excel-Schließplan ist wie der ausgedruckte WILKA-Werksplan aufgebaut. Erfassen Sie hier"]
["Ihre Schließanlage mit Schließungsnummern, Türnummern, Raumbezeichnungen, Stückzahlen Zylinder und "]
["Schlüssel, Artikel, Längen und Ausführungen. Geben Sie den einzelnen Zylindern die gewünschten Funktionen."]
[]
[]
[]
[]
[]
[]
[]
[]
[]
[]
[]
[]
[]
[]
[]
[]
[]
[]
[]
[]
[]
[]
[]
[]
[]
[]
["2.1 Systemauswahl"]
[]
["Entscheiden Sie vor der Eingabe in welchem Schließanlagensystem die Anlage bestellt werden soll. Durch"]
["Klick auf den Pfeil erscheinen in einem Dropdown-Menü alle verfügbaren Systeme."]
[]
[]
[]
[]
[]
[]
[]
[]
[]
[]
[]
[]
[]
[]
[]
[]
[]
[]
[]
[]
["2.2 Anlagenart"]
[]
["Wie bei der Systemauswahl können Sie auch hier über ein Dropdown-Menü Ihre Wunschanlagenart auswählen."]
[]
[]
[]
[]
[]
[]
[]
[]
[]
[]
[]
[]
[]
[]
[]
[]
[]
[]
[]
[]
[]
[]
[]
[]
[]
["2.3 Artikelauswahl"]
[]
["In jeder Zelle unter Artikel haben Sie ein Dropdown-Menü in dem Sie den entsprechenen Artikel auswählen können."]
["Wenn Ihnen die WILKA-Artikel geläufig sind können Sie diese natürlich auch händisch einpflegen."]
[]
[]
[]
[]
[]
[]
[]
[]
[]
[]
[]
[]
[]
[]
[]
[]
[]
[]
[]
[]
[]
[]
[]
[]
[]
[]
[]
[]
[]
[]
[]
["WICHTIG !!! Bevor Sie mit der Artikeleinpflege starten, wählen Sie Ihr gewünschtes Anlagensystem aus."]
["Die Artikelliste bezieht sich immer auf das gewählte System. Bei falscher Artikeleingabe erscheint "]
["eine Fehlermeldung."]
[]
[]
[]
[]
[]
[]
[]
[]
[]
[]
[]
[]
[]
[]
[]
[]
[]
[]
[]
[]
[]
[]
[]
[]
[]
[]
[]
[]
[]
[]
[]
[]
[]
["2.4 Färbungen und Zusatzausstattungen"]
[]
["In der Artikelliste sind neben den WILKA-Artikeln auch die möglichen Färbungen und ein Auszug aus den "]
["gängigen Zusatzausstattungen aufgeführt. Entnehmen Sie hier die entsprechenden Kurzbezeichnungen und"]
["tragen Sie diese in der Position bei der Spalte Färbung bzw. ZAS (Zusatzausstattung) ein."]
[]
[]
[]
[]
[]
[]
[]
[]
[]
[]
[]
[]
[]
[]
[]
[]
[]
[]
["3. Artikelliste"]
[]
["In der Artikelliste sind alle Schließanlagensysteme hinterlegt. Die Artikel sind nach Zylinderart (wie z.B. Doppel-,"]
["Halb-, Knaufzylinder usw.) aufgeführt. Wählen Sie den gewünschten Zylindertyp aus der nebenstehenden "]
["Beschreibung und suchen in der Spalte System die Artikelbezeichnung."]
[]
["In unserem nachstehenden Beispiel suchen wir einen Profildoppelzylinder mit Not- und Gefahrenfunktion im "]
["Wendeschlüssel-System 3VE."]
[]
[]
[]
[]
[]
[]
[]
[]
[]
[]
[]
[]
[]
[]
[]
[]
["Neben den aufgeführten Artikeltypen finden Sie hier auch die gängigen Zylinderfärbungen und -zusatzausstattungen."]
["Auch diese sind Systemabhängig aufgelistet und die Machbarkeit wird durch ein \"X\" gekennzeichnet."]
[]
[]
[]
[]
[]
[]
[]
[]
[]
[]
[]
[]
[]
[]
[]
[]
[]
[]
[]
[]
[]
[]
[]
[]
[]
["4. Sonderfunktionen mit Makro"]
[]
["Der WILKA-Excel-Schließplan enthält Sonderfunktionen die über ein Makro aktiviert werden. Um diese Funktionen"]
["nutzen zu können, müssen Sie in Ihrer Excelversion die Sicherheitsfunktion von Makros anpassen. "]
[]
[]
["4.1 Markierten Bereich drucken"]
[]
["Markieren Sie in Ihrem Schließplan den zu druckenden Bereich."]
[]
[]
[]
[]
[]
[]
[]
[]
[]
[]
[]
[]
[]
[]
[]
[]
[]
[]
[]
[]
[]
[]
[]
[]
[]
["Klicken Sie dann mit der Maus auf den Button \"Markierten Bereich drucken\" und der ausgewählte Schließplan-"]
["bereich wird auf Ihrem ausgewählten Standarddrucker ausgedruckt."]
[]
[]
[]
["4.2 Schließplanversand per E-Mail"]
[]
["Nach Fertigstellung des Schließplanes haben Sie die Möglichkeit diesen per E-Mail weiterzuleiten. Betätigen Sie"]
["hierfür den Button \"Versand per E-Mail\" "]
[]
["Es erscheint automatisch die Aufforderung den Schließplan zu speichern. Es wäre sinnvoll einen Ordner "]
["Schließanlagen (oder ähnlich) anzulegen, in dem Sie Ihre Schließpläne hinterlegen können. Geben Sie "]
["Ihrem Schließplan einen entsprechenden Namen und speichern diesen."]
["Nach dem Speichervorgang öffnet sich Ihr E-Mail-Fenster mit der Datei im Anhang. Bitte beachten Sie hier,"]
["es handelt sich hierbei nur um den reinen Schließplan, die Tabellen Anleitung, Musterschließanlagen, Artikellisten"]
["und Massenermittlung sind aufgrund der Größe nicht mehr vorhanden."]
["Sollten Sie jedoch alle Daten weiter benötigen, drücken Sie \"Speichern unter\" in Ihrer Excelversion und geben"]
["der Datei einen Namen. Die Datei WILKA-Schließplan… ist standardmäßig schreibgeschützt und kann nicht "]
["überschrieben werden."]
[]
[]
[]
[]
[]
[]
["Speichern Sie Ihre Datei wie beschrieben."]
[]
[]
[]
[]
[]
["Die Tabellen Anleitung, Musterschließanlagen, Artikelliste und Massenermittlung werden aufgrund der Dateigröße"]
["für den E-Mail-Versand gelöscht."]
[]
[]
[]
[]
[]
[]
[]
[]
[]
[]
[]
[]
[]
[]
[]
[]
[]
[]
[]
[]
[]
[]
[]
[]
["Es öffnet sich Ihr E-Mail-Programm mit der Excel-Schließplandatei im Anhang. Standardmäßig ist die E-Mail-"]
["Adresse schliessanlagen@wilka.de hinterlegt."]

{"sheet":"Musterschließanlagen","index":1,"n_rows":18,"n_cols":135,"rows_kept":18,"cut":false,"hidden":false,"merged":[[157,23,157,24],[156,23,156,24],[157,1,157,2],[157,3,157,4],[157,5,157,6],[157,7,157,12],[157,13,157,14],[157,15,157,16],[157,17,157,18],[157,19,157,20],[157,21,157,22],[155,23,155,24],[156,1,156,2],[156,3,156,4],[156,5,156,6],[156,7,156,12],[156,13,156,14],[156,15,156,16],[156,17,156,18],[156,19,156,20],[156,21,156,22],[154,23,154,24],[155,1,155,2],[155,3,155,4],[155,5,155,6],[155,7,155,12],[155,13,155,14],[155,15,155,16],[155,17,155,18],[155,19,155,20],[155,21,155,22],[153,23,153,24],[154,1,154,2],[154,3,154,4],[154,5,154,6],[154,7,154,12],[154,13,154,14],[154,15,154,16],[154,17,154,18],[154,19,154,20],[154,21,154,22],[152,23,152,24],[153,1,153,2],[153,3,153,4],[153,5,153,6],[153,7,153,12],[153,13,153,14],[153,15,153,16],[153,17,153,18],[153,19,153,20],[153,21,153,22],[151,23,151,24],[152,1,152,2],[152,3,152,4],[152,5,152,6],[152,7,152,12],[152,13,152,14],[152,15,152,16],[152,17,152,18],[152,19,152,20],[152,21,152,22],[150,23,150,24],[151,1,151,2],[151,3,151,4],[151,5,151,6],[151,7,151,12],[151,13,151,14],[151,15,151,16],[151,17,151,18],[151,19,151,20],[151,21,151,22],[149,23,149,24],[150,1,150,2],[150,3,150,4],[150,5,150,6],[150,7,150,12],[150,13,150,14],[150,15,150,16],[150,17,150,18],[150,19,150,20],[150,21,150,22],[148,23,148,24],[149,1,149,2],[149,3,149,4],[149,5,149,6],[149,7,149,12],[149,13,149,14],[149,15,149,16],[149,17,149,18],[149,19,149,20],[149,21,149,22],[147,23,147,24],[148,1,148,2],[148,3,148,4],[148,5,148,6],[148,7,148,12],[148,13,148,14],[148,15,148,16],[148,17,148,18],[148,19,148,20],[148,21,148,22],[146,23,146,24],[147,1,147,2],[147,3,147,4],[147,5,147,6],[147,7,147,12],[147,13,147,14],[147,15,147,16],[147,17,147,18],[147,19,147,20],[147,21,147,22],[145,23,145,24],[146,1,146,2],[146,3,146,4],[146,5,146,6],[146,7,146,12],[146,13,146,14],[146,15,146,16],[146,17,146,18],[146,19,146,20],[146,21,146,22],[144,23,144,24],[145,1,145,2],[145,3,145,4],[145,5,145,6],[145,7,145,12],[145,13,145,14],[145,15,145,16],[145,17,145,18],[145,19,145,20],[145,21,145,22],[143,23,143,24],[144,1,144,2],[144,3,144,4],[144,5,144,6],[144,7,144,12],[144,13,144,14],[144,15,144,16],[144,17,144,18],[144,19,144,20],[144,21,144,22],[142,23,142,24],[143,1,143,2],[143,3,143,4],[143,5,143,6],[143,7,143,12],[143,13,143,14],[143,15,143,16],[143,17,143,18],[143,19,143,20],[143,21,143,22],[141,23,141,24],[142,1,142,2],[142,3,142,4],[142,5,142,6],[142,7,142,12],[142,13,142,14],[142,15,142,16],[142,17,142,18],[142,19,142,20],[142,21,142,22],[140,23,140,24],[141,1,141,2],[141,3,141,4],[141,5,141,6],[141,7,141,12],[141,13,141,14],[141,15,141,16],[141,17,141,18],[141,19,141,20],[141,21,141,22],[139,23,139,24],[140,1,140,2],[140,3,140,4],[140,5,140,6],[140,7,140,12],[140,13,140,14],[140,15,140,16],[140,17,140,18],[140,19,140,20],[140,21,140,22],[138,23,138,24],[139,1,139,2],[139,3,139,4],[139,5,139,6],[139,7,139,12],[139,13,139,14],[139,15,139,16],[139,17,139,18],[139,19,139,20],[139,21,139,22],[137,23,137,24],[138,1,138,2],[138,3,138,4],[138,5,138,6],[138,7,138,12],[138,13,138,14],[138,15,138,16],[138,17,138,18],[138,19,138,20],[138,21,138,22],[136,23,136,24],[137,1,137,2],[137,3,137,4],[137,5,137,6],[137,7,137,12],[137,13,137,14],[137,15,137,16],[137,17,137,18],[137,19,137,20],[137,21,137,22],[135,23,135,24],[136,1,136,2],[136,3,136,4],[136,5,136,6],[136,7,136,12],[136,13,136,14],[136,15,136,16],[136,17,136,18],[136,19,136,20],[136,21,136,22],[134,23,134,24],[135,1,135,2],[135,3,135,4],[135,5,135,6],[135,7,135,12],[135,13,135,14],[135,15,135,16],[135,17,135,18],[135,19,135,20],[135,21,135,22],[133,23,133,24],[134,1,134,2],[134,3,134,4],[134,5,134,6],[134,7,134,12],[134,13,134,14],[134,15,134,16],[134,17,134,18],[134,19,134,20],[134,21,134,22],[132,23,132,24],[133,1,133,2],[133,3,133,4],[133,5,133,6],[133,7,133,12],[133,13,133,14],[133,15,133,16],[133,17,133,18],[133,19,133,20],[133,21,133,22],[131,23,131,24],[132,1,132,2],[132,3,132,4],[132,5,132,6],[132,7,132,12],[132,13,132,14],[132,15,132,16],[132,17,132,18],[132,19,132,20],[132,21,132,22],[130,23,130,24],[131,1,131,2],[131,3,131,4],[131,5,131,6],[131,7,131,12],[131,13,131,14],[131,15,131,16],[131,17,131,18],[131,19,131,20],[131,21,131,22],[129,23,129,24],[130,1,130,2],[130,3,130,4],[130,5,130,6],[130,7,130,12],[130,13,130,14],[130,15,130,16],[130,17,130,18],[130,19,130,20],[130,21,130,22],[128,23,128,24],[129,1,129,2],[129,3,129,4],[129,5,129,6],[129,7,129,12],[129,13,129,14],[129,15,129,16],[129,17,129,18],[129,19,129,20],[129,21,129,22],[127,23,127,24],[128,1,128,2],[128,3,128,4],[128,5,128,6],[128,7,128,12],[128,13,128,14],[128,15,128,16],[128,17,128,18],[128,19,128,20],[128,21,128,22],[126,23,126,24],[127,1,127,2],[127,3,127,4],[127,5,127,6],[127,7,127,12],[127,13,127,14],[127,15,127,16],[127,17,127,18],[127,19,127,20],[127,21,127,22],[125,23,125,24],[126,1,126,2],[126,3,126,4],[126,5,126,6],[126,7,126,12],[126,13,126,14],[126,15,126,16],[126,17,126,18],[126,19,126,20],[126,21,126,22],[124,23,124,24],[125,1,125,2],[125,3,125,4],[125,5,125,6],[125,7,125,12],[125,13,125,14],[125,15,125,16],[125,17,125,18],[125,19,125,20],[125,21,125,22],[123,23,123,24],[124,1,124,2],[124,3,124,4],[124,5,124,6],[124,7,124,12],[124,13,124,14],[124,15,124,16],[124,17,124,18],[124,19,124,20],[124,21,124,22],[122,23,122,24],[123,1,123,2],[123,3,123,4],[123,5,123,6],[123,7,123,12],[123,13,123,14],[123,15,123,16],[123,17,123,18],[123,19,123,20],[123,21,123,22],[121,23,121,24],[122,1,122,2],[122,3,122,4],[122,5,122,6],[122,7,122,12],[122,13,122,14],[122,15,122,16],[122,17,122,18],[122,19,122,20],[122,21,122,22],[120,23,120,24],[121,1,121,2],[121,3,121,4],[121,5,121,6],[121,7,121,12],[121,13,121,14],[121,15,121,16],[121,17,121,18],[121,19,121,20],[121,21,121,22],[119,23,119,24],[120,1,120,2],[120,3,120,4],[120,5,120,6],[120,7,120,12],[120,13,120,14],[120,15,120,16],[120,17,120,18],[120,19,120,20],[120,21,120,22],[118,23,118,24],[119,1,119,2],[119,3,119,4],[119,5,119,6],[119,7,119,12],[119,13,119,14],[119,15,119,16],[119,17,119,18],[119,19,119,20],[119,21,119,22],[117,23,117,24],[118,1,118,2],[118,3,118,4],[118,5,118,6],[118,7,118,12],[118,13,118,14],[118,15,118,16],[118,17,118,18],[118,19,118,20],[118,21,118,22],[116,23,116,24],[117,1,117,2],[117,3,117,4],[117,5,117,6],[117,7,117,12],[117,13,117,14],[117,15,117,16],[117,17,117,18],[117,19,117,20],[117,21,117,22],[115,23,115,24],[116,1,116,2],[116,3,116,4],[116,5,116,6],[116,7,116,12],[116,13,116,14],[116,15,116,16],[116,17,116,18],[116,19,116,20],[116,21,116,22],[114,23,114,24],[115,1,115,2],[115,3,115,4],[115,5,115,6],[115,7,115,12],[115,13,115,14],[115,15,115,16],[115,17,115,18],[115,19,115,20],[115,21,115,22],[113,23,113,24],[114,1,114,2],[114,3,114,4],[114,5,114,6],[114,7,114,12],[114,13,114,14],[114,15,114,16],[114,17,114,18],[114,19,114,20],[114,21,114,22],[112,23,112,24],[113,1,113,2],[113,3,113,4],[113,5,113,6],[113,7,113,12],[113,13,113,14],[113,15,113,16],[113,17,113,18],[113,19,113,20],[113,21,113,22],[111,23,111,24],[112,1,112,2],[112,3,112,4],[112,5,112,6],[112,7,112,12],[112,13,112,14],[112,15,112,16],[112,17,112,18],[112,19,112,20],[112,21,112,22],[110,23,110,24],[111,1,111,2],[111,3,111,4],[111,5,111,6],[111,7,111,12],[111,13,111,14],[111,15,111,16],[111,17,111,18],[111,19,111,20],[111,21,111,22],[109,23,109,24],[110,1,110,2],[110,3,110,4],[110,5,110,6],[110,7,110,12],[110,13,110,14],[110,15,110,16],[110,17,110,18],[110,19,110,20],[110,21,110,22],[108,23,108,24],[109,1,109,2],[109,3,109,4],[109,5,109,6],[109,7,109,12],[109,13,109,14],[109,15,109,16],[109,17,109,18],[109,19,109,20],[109,21,109,22],[107,23,107,24],[108,1,108,2],[108,3,108,4],[108,5,108,6],[108,7,108,12],[108,13,108,14],[108,15,108,16],[108,17,108,18],[108,19,108,20],[108,21,108,22],[106,23,106,24],[107,1,107,2],[107,3,107,4],[107,5,107,6],[107,7,107,12],[107,13,107,14],[107,15,107,16],[107,17,107,18],[107,19,107,20],[107,21,107,22],[105,23,105,24],[106,1,106,2],[106,3,106,4],[106,5,106,6],[106,7,106,12],[106,13,106,14],[106,15,106,16],[106,17,106,18],[106,19,106,20],[106,21,106,22],[104,23,104,24],[105,1,105,2],[105,3,105,4],[105,5,105,6],[105,7,105,12],[105,13,105,14],[105,15,105,16],[105,17,105,18],[105,19,105,20],[105,21,105,22],[103,23,103,24],[104,1,104,2],[104,3,104,4],[104,5,104,6],[104,7,104,12],[104,13,104,14],[104,15,104,16],[104,17,104,18],[104,19,104,20],[104,21,104,22],[102,23,102,24],[103,1,103,2],[103,3,103,4],[103,5,103,6],[103,7,103,12],[103,13,103,14],[103,15,103,16],[103,17,103,18],[103,19,103,20],[103,21,103,22],[101,23,101,24],[102,1,102,2],[102,3,102,4],[102,5,102,6],[102,7,102,12],[102,13,102,14],[102,15,102,16],[102,17,102,18],[102,19,102,20],[102,21,102,22],[100,23,100,24],[101,1,101,2],[101,3,101,4],[101,5,101,6],[101,7,101,12],[101,13,101,14],[101,15,101,16],[101,17,101,18],[101,19,101,20],[101,21,101,22],[99,23,99,24],[100,1,100,2],[100,3,100,4],[100,5,100,6],[100,7,100,12],[100,13,100,14],[100,15,100,16],[100,17,100,18],[100,19,100,20],[100,21,100,22],[98,23,98,24],[99,1,99,2],[99,3,99,4],[99,5,99,6],[99,7,99,12],[99,13,99,14],[99,15,99,16],[99,17,99,18],[99,19,99,20],[99,21,99,22],[97,23,97,24],[98,1,98,2],[98,3,98,4],[98,5,98,6],[98,7,98,12],[98,13,98,14],[98,15,98,16],[98,17,98,18],[98,19,98,20],[98,21,98,22],[96,23,96,24],[97,1,97,2],[97,3,97,4],[97,5,97,6],[97,7,97,12],[97,13,97,14],[97,15,97,16],[97,17,97,18],[97,19,97,20],[97,21,97,22],[95,23,95,24],[96,1,96,2],[96,3,96,4],[96,5,96,6],[96,7,96,12],[96,13,96,14],[96,15,96,16],[96,17,96,18],[96,19,96,20],[96,21,96,22],[94,23,94,24],[95,1,95,2],[95,3,95,4],[95,5,95,6],[95,7,95,12],[95,13,95,14],[95,15,95,16],[95,17,95,18],[95,19,95,20],[95,21,95,22],[93,23,93,24],[94,1,94,2],[94,3,94,4],[94,5,94,6],[94,7,94,12],[94,13,94,14],[94,15,94,16],[94,17,94,18],[94,19,94,20],[94,21,94,22],[92,23,92,24],[93,1,93,2],[93,3,93,4],[93,5,93,6],[93,7,93,12],[93,13,93,14],[93,15,93,16],[93,17,93,18],[93,19,93,20],[93,21,93,22],[91,23,91,24],[92,1,92,2],[92,3,92,4],[92,5,92,6],[92,7,92,12],[92,13,92,14],[92,15,92,16],[92,17,92,18],[92,19,92,20],[92,21,92,22],[90,23,90,24],[91,1,91,2],[91,3,91,4],[91,5,91,6],[91,7,91,12],[91,13,91,14],[91,15,91,16],[91,17,91,18],[91,19,91,20],[91,21,91,22],[89,23,89,24],[90,1,90,2],[90,3,90,4],[90,5,90,6],[90,7,90,12],[90,13,90,14],[90,15,90,16],[90,17,90,18],[90,19,90,20],[90,21,90,22],[88,23,88,24],[89,1,89,2],[89,3,89,4],[89,5,89,6],[89,7,89,12],[89,13,89,14],[89,15,89,16],[89,17,89,18],[89,19,89,20],[89,21,89,22],[87,23,87,24],[88,1,88,2],[88,3,88,4],[88,5,88,6],[88,7,88,12],[88,13,88,14],[88,15,88,16],[88,17,88,18],[88,19,88,20],[88,21,88,22],[86,23,86,24],[87,1,87,2],[87,3,87,4],[87,5,87,6],[87,7,87,12],[87,13,87,14],[87,15,87,16],[87,17,87,18],[87,19,87,20],[87,21,87,22],[85,23,85,24],[86,1,86,2],[86,3,86,4],[86,5,86,6],[86,7,86,12],[86,13,86,14],[86,15,86,16],[86,17,86,18],[86,19,86,20],[86,21,86,22],[84,23,84,24],[85,1,85,2],[85,3,85,4],[85,5,85,6],[85,7,85,12],[85,13,85,14],[85,15,85,16],[85,17,85,18],[85,19,85,20],[85,21,85,22],[83,23,83,24],[84,1,84,2],[84,3,84,4],[84,5,84,6],[84,7,84,12],[84,13,84,14],[84,15,84,16],[84,17,84,18],[84,19,84,20],[84,21,84,22],[82,23,82,24],[83,1,83,2],[83,3,83,4],[83,5,83,6],[83,7,83,12],[83,13,83,14],[83,15,83,16],[83,17,83,18],[83,19,83,20],[83,21,83,22],[81,23,81,24],[82,1,82,2],[82,3,82,4],[82,5,82,6],[82,7,82,12],[82,13,82,14],[82,15,82,16],[82,17,82,18],[82,19,82,20],[82,21,82,22],[80,23,80,24],[81,1,81,2],[81,3,81,4],[81,5,81,6],[81,7,81,12],[81,13,81,14],[81,15,81,16],[81,17,81,18],[81,19,81,20],[81,21,81,22],[79,23,79,24],[80,1,80,2],[80,3,80,4],[80,5,80,6],[80,7,80,12],[80,13,80,14],[80,15,80,16],[80,17,80,18],[80,19,80,20],[80,21,80,22],[78,23,78,24],[79,1,79,2],[79,3,79,4],[79,5,79,6],[79,7,79,12],[79,13,79,14],[79,15,79,16],[79,17,79,18],[79,19,79,20],[79,21,79,22],[77,23,77,24],[78,1,78,2],[78,3,78,4],[78,5,78,6],[78,7,78,12],[78,13,78,14],[78,15,78,16],[78,17,78,18],[78,19,78,20],[78,21,78,22],[76,23,76,24],[77,1,77,2],[77,3,77,4],[77,5,77,6],[77,7,77,12],[77,13,77,14],[77,15,77,16],[77,17,77,18],[77,19,77,20],[77,21,77,22],[75,23,75,24],[76,1,76,2],[76,3,76,4],[76,5,76,6],[76,7,76,12],[76,13,76,14],[76,15,76,16],[76,17,76,18],[76,19,76,20],[76,21,76,22],[74,23,74,24],[75,1,75,2],[75,3,75,4],[75,5,75,6],[75,7,75,12],[75,13,75,14],[75,15,75,16],[75,17,75,18],[75,19,75,20],[75,21,75,22],[73,23,73,24],[74,1,74,2],[74,3,74,4],[74,5,74,6],[74,7,74,12],[74,13,74,14],[74,15,74,16],[74,17,74,18],[74,19,74,20],[74,21,74,22],[72,23,72,24],[73,1,73,2],[73,3,73,4],[73,5,73,6],[73,7,73,12],[73,13,73,14],[73,15,73,16],[73,17,73,18],[73,19,73,20],[73,21,73,22],[71,23,71,24],[72,1,72,2],[72,3,72,4],[72,5,72,6],[72,7,72,12],[72,13,72,14],[72,15,72,16],[72,17,72,18],[72,19,72,20],[72,21,72,22],[70,23,70,24],[71,1,71,2],[71,3,71,4],[71,5,71,6],[71,7,71,12],[71,13,71,14],[71,15,71,16],[71,17,71,18],[71,19,71,20],[71,21,71,22],[69,23,69,24],[70,1,70,2],[70,3,70,4],[70,5,70,6],[70,7,70,12],[70,13,70,14],[70,15,70,16],[70,17,70,18],[70,19,70,20],[70,21,70,22],[68,23,68,24],[69,1,69,2],[69,3,69,4],[69,5,69,6],[69,7,69,12],[69,13,69,14],[69,15,69,16],[69,17,69,18],[69,19,69,20],[69,21,69,22],[67,23,67,24],[68,1,68,2],[68,3,68,4],[68,5,68,6],[68,7,68,12],[68,13,68,14],[68,15,68,16],[68,17,68,18],[68,19,68,20],[68,21,68,22],[66,23,66,24],[67,1,67,2],[67,3,67,4],[67,5,67,6],[67,7,67,12],[67,13,67,14],[67,15,67,16],[67,17,67,18],[67,19,67,20],[67,21,67,22],[65,23,65,24],[66,1,66,2],[66,3,66,4],[66,5,66,6],[66,7,66,12],[66,13,66,14],[66,15,66,16],[66,17,66,18],[66,19,66,20],[66,21,66,22],[64,23,64,24],[65,1,65,2],[65,3,65,4],[65,5,65,6],[65,7,65,12],[65,13,65,14],[65,15,65,16],[65,17,65,18],[65,19,65,20],[65,21,65,22],[63,23,63,24],[64,1,64,2],[64,3,64,4],[64,5,64,6],[64,7,64,12],[64,13,64,14],[64,15,64,16],[64,17,64,18],[64,19,64,20],[64,21,64,22],[62,23,62,24],[63,1,63,2],[63,3,63,4],[63,5,63,6],[63,7,63,12],[63,13,63,14],[63,15,63,16],[63,17,63,18],[63,19,63,20],[63,21,63,22],[61,23,61,24],[62,1,62,2],[62,3,62,4],[62,5,62,6],[62,7,62,12],[62,13,62,14],[62,15,62,16],[62,17,62,18],[62,19,62,20],[62,21,62,22],[60,23,60,24],[61,1,61,2],[61,3,61,4],[61,5,61,6],[61,7,61,12],[61,13,61,14],[61,15,61,16],[61,17,61,18],[61,19,61,20],[61,21,61,22],[59,23,59,24],[60,1,60,2],[60,3,60,4],[60,5,60,6],[60,7,60,12],[60,13,60,14],[60,15,60,16],[60,17,60,18],[60,19,60,20],[60,21,60,22],[58,23,58,24],[59,1,59,2],[59,3,59,4],[59,5,59,6],[59,7,59,12],[59,13,59,14],[59,15,59,16],[59,17,59,18],[59,19,59,20],[59,21,59,22],[57,23,57,24],[58,1,58,2],[58,3,58,4],[58,5,58,6],[58,7,58,12],[58,13,58,14],[58,15,58,16],[58,17,58,18],[58,19,58,20]],"merged_total":1784,"flags":["merged_cut"]}
["GHS",".",null,null,null,null,null,null,null,null,null,null,null,"Fachhändler:",null,null,null,null,null,null,null,null,null,null,null,"Anzahl",null,null,null,null,null,null,null,null,null,null,null,null,null,null,null,null,null,null,null,null,null,null,null,null,null,null,1,2,3,4,5,6,7,8,9,10,11,12,13,14,15,16,17,18,19,20,21,22,23,24,25,26,27,28,29,30,31,32,33,34,35,36,37,38,39,40,41,42,43,44,45,46,47,48,49,50,51,52,53,54,55,56,57,58,59,60,61,62,63,64,65,66,67,68,69,70,71,72,73,74,75,76,77,78,79,80,81,82,83]
["HS","."]
["HS/Z",".","Anlagenart:",null,null,"GHS",null,null,null,null,null,null,null,null,null,null,null,null,null,null,null,null,null,null,null,"Übergeordnete Schlüssel"]
["Z/HS",".","System:",null,null,"TH6"]
["Z ",".","Kunde:",null,null,"Max Mustermann",null,null,null,null,null,null,null,"Feld für Hinweise:"]
["SP",".",null,null,null,"Musterstr. 1"]
["STR",".",null,null,null,"55555 Musterdorf"]
["HSR",".","Kom.:",null,null,"Muster "]
["Standard",".","Datum:",null,null,"2006-03-30",null,null,null,null,null,null,null,null,null,null,null,null,null,null,null,null,null,null,null,null,{"$f":"IF(VLOOKUP($F$3,$BA$13:$IV$18,11,FALSE)<=0,\"\",VLOOKUP($F$3,$BA$13:$IV$18,11,FALSE))","v":"GHS"},{"$f":"IF(VLOOKUP($F$3,$BA$13:$IV$18,12,FALSE)<=0,\"\",VLOOKUP($F$3,$BA$13:$IV$18,12,FALSE))","v":"GS 1"},{"$f":"IF(VLOOKUP($F$3,$BA$13:$IV$18,13,FALSE)<=0,\"\",VLOOKUP($F$3,$BA$13:$IV$18,13,FALSE))","v":"GS 2"},{"$f":"IF(VLOOKUP($F$3,$BA$13:$IV$18,14,FALSE)<=0,\"\",VLOOKUP($F$3,$BA$13:$IV$18,14,FALSE))","v":"GS 3"},null,null,null,null,null,null,null,null,null,null,null,null,null,null,null,null,null,null,null,null,null,null,null,null,null,null,null,null,null,null,null,null,null,null,null,null,null,null,null,null,null,null,null,null,null,null,null,null,null,null,null,null,null,null,null,null,null,null,null,null,null,null,null,null,null,null,null,null,null,null,null,null,null,null,null,null,null,null,null,null,null,"Spalte 1",null,null,null,null,null,"Spalte 2",null,null,null,null,null,"Spalte 3",null,null,null,null,null,"Spalte 4"]
["WZ","WILKA - VORSPRUNG DURCH QUALITÄT",null,null,null,null,null,null,null,null,null,null,null,".",null,null,null,null,null,null,null,null,null,null,null,null,{"$f":"IF(VLOOKUP($F$3,$BA$13:$IV$18,58,FALSE)<=0,\"\",VLOOKUP($F$3,$BA$13:$IV$18,58,FALSE))","v":"Mmv"},"Mmv","Mmv","Mmv"]
[null,"Position",null,"Schließungs- nummer",null,"Türnummer",null,"Raumbezeichnung",null,null,null,null,null,"Stückzahl",null,null,null,"Artikel",null,"Längen",null,null,null,"Färbung ",null,null,"Mmv","Mmv","Mmv","Mmv"]
[null,null,null,null,null,null,null,null,null,null,null,null,null,"Zylinder",null,"Schlüssel",null,null,null,"A  Aussen",null,"B   Innen",null,null,null,"ZAS",null,null,null,null,null,null,null,null,null,null,null,null,null,null,null,null,null,null,null,null,null,null,null,null,null,null,"Art","Schlg. 1","Bez. 1","Stückz. 1","Schlüssel 1","Artikel 1","Lg A1","Lg B1","Färb. 1","ZAS 1","Übg 1","Übg 2","Übg 3","Übg 4","Schlg. 2","Bez. 2","Stückz. 2","Schlüssel 2","Artikel 2","Lg A2","Lg B2","Färb. 2","ZAS 2","Schlg. 3","Bez. 3","Stückz. 3","Schlüssel 3","Artikel 3","Lg A3","Lg B3","Färb. 3","ZAS 3","Schlg. 4","Bez. 4","Stückz. 4","Schlüssel 4","Artikel 4","Lg A4","Lg B4","Färb. 4","ZAS 4","Schlg. 5","Bez. 5","Stückz. 5","Schlüssel 5","Artikel 5","Lg A5","Lg B5","Färb. 5","ZAS 5","Schlg. 6","Bez. 6","Stückz. 6","Schlüssel 6","Artikel 6","Lg A6","Lg B6","Färb. 6","ZAS 6","Fkt. 1","Fkt. 2","Fkt. 3","Fkt. 4","Fkt. 5","Fkt. 6","Fkt. 7","Fkt. 8","Fkt. 9","Fkt.10","Fkt.11","Fkt.12","Fkt.13","Fkt.14","Fkt.15","Fkt.16","Fkt.17","Fkt.18","Fkt.19","Fkt.20","Fkt.21","Fkt.22","Fkt.23","Fkt.24"]
[null,null,null,{"$f":"IF(VLOOKUP($F$3,$BA$13:$IV$18,2,FALSE)<=0,\"\",VLOOKUP($F$3,$BA$13:$IV$18,2,FALSE))","v":1},null,null,null,{"$f":"IF(VLOOKUP($F$3,$BA$13:$IV$18,3,FALSE)<=0,\"\",VLOOKUP($F$3,$BA$13:$IV$18,3,FALSE))","v":"Verwaltung"},null,{"$f":"IF(VLOOKUP($F$3,$BA$13:$IV$18,2,FALSE)<=0,\"\",VLOOKUP($F$3,$BA$13:$IV$18,2,FALSE))","v":1},null,{"$f":"IF(VLOOKUP($F$3,$BA$13:$IV$18,2,FALSE)<=0,\"\",VLOOKUP($F$3,$BA$13:$IV$18,2,FALSE))","v":1},null,{"$f":"IF(VLOOKUP($F$3,$BA$13:$IV$18,4,FALSE)<=0,\"\",VLOOKUP($F$3,$BA$13:$IV$18,4,FALSE))","v":2},null,{"$f":"IF(VLOOKUP($F$3,$BA$13:$IV$18,5,FALSE)<=0,\"\",VLOOKUP($F$3,$BA$13:$IV$18,5,FALSE))","v":6},null,{"$f":"IF(VLOOKUP($F$3,$BA$13:$IV$18,6,FALSE)<=0,\"\",VLOOKUP($F$3,$BA$13:$IV$18,6,FALSE))","v":1400},null,{"$f":"IF(VLOOKUP($F$3,$BA$13:$IV$18,7,FALSE)<=0,\"\",VLOOKUP($F$3,$BA$13:$IV$18,7,FALSE))","v":30},null,{"$f":"IF(VLOOKUP($F$3,$BA$13:$IV$18,8,FALSE)<=0,\"\",VLOOKUP($F$3,$BA$13:$IV$18,8,FALSE))","v":40},null,{"$f":"IF(VLOOKUP($F$3,$BA$13:$IV$18,9,FALSE)<=0,\"\",VLOOKUP($F$3,$BA$13:$IV$18,9,FALSE))","v":"Mmv"},null,{"$f":"IF(VLOOKUP($F$3,$BA$13:$IV$18,10,FALSE)<=0,\"\",VLOOKUP($F$3,$BA$13:$IV$18,10,FALSE))","v":""},{"$f":"IF(VLOOKUP($F$3,$BA$13:$IV$18,60,FALSE)<=0,\"\",VLOOKUP($F$3,$BA$13:$IV$18,60,FALSE))","v":"X"},{"$f":"IF(VLOOKUP($F$3,$BA$13:$IV$18,66,FALSE)<=0,\"\",VLOOKUP($F$3,$BA$13:$IV$18,66,FALSE))","v":"X"},{"$f":"IF(VLOOKUP($F$3,$BA$13:$IV$18,72,FALSE)<=0,\"\",VLOOKUP($F$3,$BA$13:$IV$18,72,FALSE))","v":""},{"$f":"IF(VLOOKUP($F$3,$BA$13:$IV$18,78,FALSE)<=0,\"\",VLOOKUP($F$3,$BA$13:$IV$18,78,FALSE))","v":"X"},null,null,null,null,null,null,null,null,null,null,null,null,null,null,null,null,null,null,null,null,null,null,"GHS",1,"Verwaltung",2,6,1400,30,40,"Mmv",null,"GHS","GS 1","GS 2","GS 3",2,"Buchhaltung",1,3,1400,40,40,"Mmv",null,3,"Produktion",1,3,1405,30,30,"Mmv",null,4,"Versand",1,3,1400,30,30,"Mmv",null,5,"Verkauf",1,3,1400,30,30,"Mpol",null,6,"Einkauf",1,3,1405,30,40,"Mmv",5,"X","X","X","X","X","X","X","X",null,null,"X","X",null,null,"X","X",null,null,"X",null,null,null,"X","X"]
[null,null,null,{"$f":"IF(VLOOKUP($F$3,$BA$13:$IV$18,15,FALSE)<=0,\"\",VLOOKUP($F$3,$BA$13:$IV$18,15,FALSE))","v":2},null,null,null,{"$f":"IF(VLOOKUP($F$3,$BA$13:$IV$18,16,FALSE)<=0,\"\",VLOOKUP($F$3,$BA$13:$IV$18,16,FALSE))","v":"Buchhaltung"},null,1,null,1,null,{"$f":"IF(VLOOKUP($F$3,$BA$13:$IV$18,17,FALSE)<=0,\"\",VLOOKUP($F$3,$BA$13:$IV$18,17,FALSE))","v":1},null,{"$f":"IF(VLOOKUP($F$3,$BA$13:$IV$18,18,FALSE)<=0,\"\",VLOOKUP($F$3,$BA$13:$IV$18,18,FALSE))","v":3},null,{"$f":"IF(VLOOKUP($F$3,$BA$13:$IV$18,19,FALSE)<=0,\"\",VLOOKUP($F$3,$BA$13:$IV$18,19,FALSE))","v":1400},null,{"$f":"IF(VLOOKUP($F$3,$BA$13:$IV$18,20,FALSE)<=0,\"\",VLOOKUP($F$3,$BA$13:$IV$18,20,FALSE))","v":40},null,{"$f":"IF(VLOOKUP($F$3,$BA$13:$IV$18,21,FALSE)<=0,\"\",VLOOKUP($F$3,$BA$13:$IV$18,21,FALSE))","v":40},null,{"$f":"IF(VLOOKUP($F$3,$BA$13:$IV$18,22,FALSE)<=0,\"\",VLOOKUP($F$3,$BA$13:$IV$18,22,FALSE))","v":"Mmv"},null,{"$f":"IF(VLOOKUP($F$3,$BA$13:$IV$18,23,FALSE)<=0,\"\",VLOOKUP($F$3,$BA$13:$IV$18,23,FALSE))","v":""},{"$f":"IF(VLOOKUP($F$3,$BA$13:$IV$18,61,FALSE)<=0,\"\",VLOOKUP($F$3,$BA$13:$IV$18,61,FALSE))","v":"X"},{"$f":"IF(VLOOKUP($F$3,$BA$13:$IV$18,67,FALSE)<=0,\"\",VLOOKUP($F$3,$BA$13:$IV$18,67,FALSE))","v":"X"},{"$f":"IF(VLOOKUP($F$3,$BA$13:$IV$18,73,FALSE)<=0,\"\",VLOOKUP($F$3,$BA$13:$IV$18,73,FALSE))","v":""},{"$f":"IF(VLOOKUP($F$3,$BA$13:$IV$18,79,FALSE)<=0,\"\",VLOOKUP($F$3,$BA$13:$IV$18,79,FALSE))","v":""},null,null,null,null,null,null,null,null,null,null,null,null,null,null,null,null,null,null,null,null,null,null,"HS",1,"Verwaltung",1,3,1463,30,45,"Mmv",null,"HS",null,null,null,2,"Buchhaltung",1,3,1463,30,40,"Mmv",null,3,"Produktion",1,3,1400,30,40,"Mmv",null,4,"Versand",1,3,1400,30,40,"Mmv",null,5,"Verkauf",1,3,1463,30,40,"Mpol",null,null,null,null,null,null,null,null,null,null,"X","X","X","X","X"]
[null,null,null,{"$f":"IF(VLOOKUP($F$3,$BA$13:$IV$18,24,FALSE)<=0,\"\",VLOOKUP($F$3,$BA$13:$IV$18,24,FALSE))","v":3},null,null,null,{"$f":"IF(VLOOKUP($F$3,$BA$13:$IV$18,25,FALSE)<=0,\"\",VLOOKUP($F$3,$BA$13:$IV$18,25,FALSE))","v":"Produktion"},null,1,null,1,null,{"$f":"IF(VLOOKUP($F$3,$BA$13:$IV$18,26,FALSE)<=0,\"\",VLOOKUP($F$3,$BA$13:$IV$18,26,FALSE))","v":1},null,{"$f":"IF(VLOOKUP($F$3,$BA$13:$IV$18,27,FALSE)<=0,\"\",VLOOKUP($F$3,$BA$13:$IV$18,27,FALSE))","v":3},null,{"$f":"IF(VLOOKUP($F$3,$BA$13:$IV$18,28,FALSE)<=0,\"\",VLOOKUP($F$3,$BA$13:$IV$18,28,FALSE))","v":1405},null,{"$f":"IF(VLOOKUP($F$3,$BA$13:$IV$18,29,FALSE)<=0,\"\",VLOOKUP($F$3,$BA$13:$IV$18,29,FALSE))","v":30},null,{"$f":"IF(VLOOKUP($F$3,$BA$13:$IV$18,30,FALSE)<=0,\"\",VLOOKUP($F$3,$BA$13:$IV$18,30,FALSE))","v":30},null,{"$f":"IF(VLOOKUP($F$3,$BA$13:$IV$18,31,FALSE)<=0,\"\",VLOOKUP($F$3,$BA$13:$IV$18,31,FALSE))","v":"Mmv"},null,{"$f":"IF(VLOOKUP($F$3,$BA$13:$IV$18,32,FALSE)<=0,\"\",VLOOKUP($F$3,$BA$13:$IV$18,32,FALSE))","v":""},{"$f":"IF(VLOOKUP($F$3,$BA$13:$IV$18,62,FALSE)<=0,\"\",VLOOKUP($F$3,$BA$13:$IV$18,62,FALSE))","v":"X"},{"$f":"IF(VLOOKUP($F$3,$BA$13:$IV$18,68,FALSE)<=0,\"\",VLOOKUP($F$3,$BA$13:$IV$18,68,FALSE))","v":""},{"$f":"IF(VLOOKUP($F$3,$BA$13:$IV$18,74,FALSE)<=0,\"\",VLOOKUP($F$3,$BA$13:$IV$18,74,FALSE))","v":"X"},{"$f":"IF(VLOOKUP($F$3,$BA$13:$IV$18,80,FALSE)<=0,\"\",VLOOKUP($F$3,$BA$13:$IV$18,80,FALSE))","v":""},null,null,null,null,null,null,null,null,null,null,null,null,null,null,null,null,null,null,null,null,null,null,"HS/Z","Z","Haustür",1,3,1463,30,50,"Mmv",null,"HS",null,"Z",null,1,"Wohnung 1",1,3,1463,40,50,"Mmv",null,2,"Wohnung 2",1,3,1463,40,50,"Mmv",null,3,"Heizungsraum",1,null,1400,30,50,"Mmv",null,"Z","Kellertür",1,3,1400,30,50,"Mmv",null,null,null,null,null,null,null,null,null,null,"X","X","X","X","X",null,null,null,null,null,null,null,"Z","I","I","I","Z"]
[null,null,null,{"$f":"IF(VLOOKUP($F$3,$BA$13:$IV$18,33,FALSE)<=0,\"\",VLOOKUP($F$3,$BA$13:$IV$18,33,FALSE))","v":4},null,null,null,{"$f":"IF(VLOOKUP($F$3,$BA$13:$IV$18,34,FALSE)<=0,\"\",VLOOKUP($F$3,$BA$13:$IV$18,34,FALSE))","v":"Versand"},null,1,null,1,null,{"$f":"IF(VLOOKUP($F$3,$BA$13:$IV$18,35,FALSE)<=0,\"\",VLOOKUP($F$3,$BA$13:$IV$18,35,FALSE))","v":1},null,{"$f":"IF(VLOOKUP($F$3,$BA$13:$IV$18,36,FALSE)<=0,\"\",VLOOKUP($F$3,$BA$13:$IV$18,36,FALSE))","v":3},null,{"$f":"IF(VLOOKUP($F$3,$BA$13:$IV$18,37,FALSE)<=0,\"\",VLOOKUP($F$3,$BA$13:$IV$18,37,FALSE))","v":1400},null,{"$f":"IF(VLOOKUP($F$3,$BA$13:$IV$18,38,FALSE)<=0,\"\",VLOOKUP($F$3,$BA$13:$IV$18,38,FALSE))","v":30},null,{"$f":"IF(VLOOKUP($F$3,$BA$13:$IV$18,39,FALSE)<=0,\"\",VLOOKUP($F$3,$BA$13:$IV$18,39,FALSE))","v":30},null,{"$f":"IF(VLOOKUP($F$3,$BA$13:$IV$18,40,FALSE)<=0,\"\",VLOOKUP($F$3,$BA$13:$IV$18,40,FALSE))","v":"Mmv"},null,{"$f":"IF(VLOOKUP($F$3,$BA$13:$IV$18,41,FALSE)<=0,\"\",VLOOKUP($F$3,$BA$13:$IV$18,41,FALSE))","v":""},{"$f":"IF(VLOOKUP($F$3,$BA$13:$IV$18,63,FALSE)<=0,\"\",VLOOKUP($F$3,$BA$13:$IV$18,63,FALSE))","v":"X"},{"$f":"IF(VLOOKUP($F$3,$BA$13:$IV$18,69,FALSE)<=0,\"\",VLOOKUP($F$3,$BA$13:$IV$18,69,FALSE))","v":""},{"$f":"IF(VLOOKUP($F$3,$BA$13:$IV$18,75,FALSE)<=0,\"\",VLOOKUP($F$3,$BA$13:$IV$18,75,FALSE))","v":"X"},{"$f":"IF(VLOOKUP($F$3,$BA$13:$IV$18,81,FALSE)<=0,\"\",VLOOKUP($F$3,$BA$13:$IV$18,81,FALSE))","v":""},null,null,null,null,null,null,null,null,null,null,null,null,null,null,null,null,null,null,null,null,null,null,"Z/HS","Z","Haustür",1,3,1405,50,30,"Mmv",4,"HS T",null,"Z",null,1,"Wohnung 1",1,3,1463,40,40,"Mmv",null,2,"Wohnung 2",1,3,1463,30,50,"Mmv",null,3,"Heizungsraum",1,null,1400,30,40,"Mmv",null,"Z","Kellertür",1,3,1400,30,30,"Mmv",null,null,null,null,null,null,null,null,null,null,"X",null,null,"X","X",null,null,null,null,null,null,null,"Z","I","I","I","Z"]
[null,null,null,{"$f":"IF(VLOOKUP($F$3,$BA$13:$IV$18,42,FALSE)<=0,\"\",VLOOKUP($F$3,$BA$13:$IV$18,42,FALSE))","v":5},null,null,null,{"$f":"IF(VLOOKUP($F$3,$BA$13:$IV$18,43,FALSE)<=0,\"\",VLOOKUP($F$3,$BA$13:$IV$18,43,FALSE))","v":"Verkauf"},null,1,null,1,null,{"$f":"IF(VLOOKUP($F$3,$BA$13:$IV$18,44,FALSE)<=0,\"\",VLOOKUP($F$3,$BA$13:$IV$18,44,FALSE))","v":1},null,{"$f":"IF(VLOOKUP($F$3,$BA$13:$IV$18,45,FALSE)<=0,\"\",VLOOKUP($F$3,$BA$13:$IV$18,45,FALSE))","v":3},null,{"$f":"IF(VLOOKUP($F$3,$BA$13:$IV$18,46,FALSE)<=0,\"\",VLOOKUP($F$3,$BA$13:$IV$18,46,FALSE))","v":1400},null,{"$f":"IF(VLOOKUP($F$3,$BA$13:$IV$18,47,FALSE)<=0,\"\",VLOOKUP($F$3,$BA$13:$IV$18,47,FALSE))","v":30},null,{"$f":"IF(VLOOKUP($F$3,$BA$13:$IV$18,48,FALSE)<=0,\"\",VLOOKUP($F$3,$BA$13:$IV$18,48,FALSE))","v":30},null,{"$f":"IF(VLOOKUP($F$3,$BA$13:$IV$18,49,FALSE)<=0,\"\",VLOOKUP($F$3,$BA$13:$IV$18,49,FALSE))","v":"Mpol"},null,{"$f":"IF(VLOOKUP($F$3,$BA$13:$IV$18,50,FALSE)<=0,\"\",VLOOKUP($F$3,$BA$13:$IV$18,50,FALSE))","v":""},{"$f":"IF(VLOOKUP($F$3,$BA$13:$IV$18,64,FALSE)<=0,\"\",VLOOKUP($F$3,$BA$13:$IV$18,64,FALSE))","v":"X"},{"$f":"IF(VLOOKUP($F$3,$BA$13:$IV$18,70,FALSE)<=0,\"\",VLOOKUP($F$3,$BA$13:$IV$18,70,FALSE))","v":"X"},{"$f":"IF(VLOOKUP($F$3,$BA$13:$IV$18,76,FALSE)<=0,\"\",VLOOKUP($F$3,$BA$13:$IV$18,76,FALSE))","v":""},{"$f":"IF(VLOOKUP($F$3,$BA$13:$IV$18,82,FALSE)<=0,\"\",VLOOKUP($F$3,$BA$13:$IV$18,82,FALSE))","v":"X"},null,null,null,null,null,null,null,null,null,null,null,null,null,null,null,null,null,null,null,null,null,null,"Z ","Z","Haustür",1,3,1400,40,40,"Mmv",null,"Z",null,3,null,1,"Wohnung 1",1,3,1463,30,50,"Mmv",null,2,"Wohnung 2",1,3,1463,40,40,"Mmv",null,3,"Heizungsraum",1,3,1400,30,30,"Mmv",null,"Z","Kellertür",2,null,1400,30,40,"Mmv",null,null,null,null,null,null,null,null,null,null,"Z","I","I","I","Z",null,null,null,null,null,null,null,null,"I",null,"M"]
[null,null,null,{"$f":"IF(VLOOKUP($F$3,$BA$13:$IV$18,51,FALSE)<=0,\"\",VLOOKUP($F$3,$BA$13:$IV$18,51,FALSE))","v":6},null,null,null,{"$f":"IF(VLOOKUP($F$3,$BA$13:$IV$18,52,FALSE)<=0,\"\",VLOOKUP($F$3,$BA$13:$IV$18,52,FALSE))","v":"Einkauf"},null,1,null,1,null,{"$f":"IF(VLOOKUP($F$3,$BA$13:$IV$18,53,FALSE)<=0,\"\",VLOOKUP($F$3,$BA$13:$IV$18,53,FALSE))","v":1},null,{"$f":"IF(VLOOKUP($F$3,$BA$13:$IV$18,54,FALSE)<=0,\"\",VLOOKUP($F$3,$BA$13:$IV$18,54,FALSE))","v":3},null,{"$f":"IF(VLOOKUP($F$3,$BA$13:$IV$18,55,FALSE)<=0,\"\",VLOOKUP($F$3,$BA$13:$IV$18,55,FALSE))","v":1405},null,{"$f":"IF(VLOOKUP($F$3,$BA$13:$IV$18,56,FALSE)<=0,\"\",VLOOKUP($F$3,$BA$13:$IV$18,56,FALSE))","v":30},null,{"$f":"IF(VLOOKUP($F$3,$BA$13:$IV$18,57,FALSE)<=0,\"\",VLOOKUP($F$3,$BA$13:$IV$18,57,FALSE))","v":40},null,{"$f":"IF(VLOOKUP($F$3,$BA$13:$IV$18,58,FALSE)<=0,\"\",VLOOKUP($F$3,$BA$13:$IV$18,58,FALSE))","v":"Mmv"},null,{"$f":"IF(VLOOKUP($F$3,$BA$13:$IV$18,59,FALSE)<=0,\"\",VLOOKUP($F$3,$BA$13:$IV$18,59,FALSE))","v":5},{"$f":"IF(VLOOKUP($F$3,$BA$13:$IV$18,65,FALSE)<=0,\"\",VLOOKUP($F$3,$BA$13:$IV$18,65,FALSE))","v":"X"},{"$f":"IF(VLOOKUP($F$3,$BA$13:$IV$18,71,FALSE)<=0,\"\",VLOOKUP($F$3,$BA$13:$IV$18,71,FALSE))","v":"X"},{"$f":"IF(VLOOKUP($F$3,$BA$13:$IV$18,77,FALSE)<=0,\"\",VLOOKUP($F$3,$BA$13:$IV$18,77,FALSE))","v":""},{"$f":"IF(VLOOKUP($F$3,$BA$13:$IV$18,83,FALSE)<=0,\"\",VLOOKUP($F$3,$BA$13:$IV$18,83,FALSE))","v":"X"},null,null,null,null,null,null,null,null,null,null,null,null,null,null,null,null,null,null,null,null,null,null,"SP",1,"Haustür",1,3,1400,30,30,"Mmv",null,null,null,null,null,1,"Wohnung  ",1,3,1463,30,30,"Mmv",null,1,"Garage",1,null,1410,null,30,"Mmv"]

{"sheet":"Schließplan","index":2,"n_rows":3131,"n_cols":13,"rows_kept":3131,"cut":false,"hidden":false,"merged":[[4,22,9,22],[1,19,3,19],[10,112,12,112],[10,113,12,113],[10,110,12,110],[10,111,12,111],[10,102,12,102],[10,103,12,103],[10,96,12,96],[10,97,12,97],[10,80,12,80],[10,81,12,81],[10,82,12,82],[10,83,12,83],[10,76,12,76],[10,77,12,77],[10,78,12,78],[10,79,12,79],[10,72,12,72],[10,73,12,73],[10,74,12,74],[10,75,12,75],[10,68,12,68],[10,69,12,69],[10,92,12,92],[10,93,12,93],[10,94,12,94],[10,95,12,95],[10,88,12,88],[10,89,12,89],[10,90,12,90],[10,91,12,91],[10,84,12,84],[10,85,12,85],[10,86,12,86],[10,87,12,87],[10,108,12,108],[10,109,12,109],[10,104,12,104],[10,105,12,105],[10,106,12,106],[10,107,12,107],[10,100,12,100],[10,101,12,101],[10,98,12,98],[10,99,12,99],[10,70,12,70],[10,71,12,71],[10,64,12,64],[10,65,12,65],[10,66,12,66],[10,67,12,67],[10,60,12,60],[10,61,12,61],[10,62,12,62],[10,63,12,63],[10,57,12,57],[10,58,12,58],[10,59,12,59],[10,52,12,52],[10,53,12,53],[10,54,12,54],[10,55,12,55],[10,48,12,48],[10,49,12,49],[10,50,12,50],[10,51,12,51],[10,19,12,19],[10,32,12,32],[10,33,12,33],[10,34,12,34],[10,35,12,35],[10,28,12,28],[10,29,12,29],[10,30,12,30],[10,31,12,31],[10,24,12,24],[10,25,12,25],[10,26,12,26],[10,27,12,27],[4,82,9,82],[4,83,9,83],[4,84,9,84],[4,85,9,85],[4,86,9,86],[4,87,9,87],[4,88,9,88],[10,20,12,20],[10,21,12,21],[10,22,12,22],[10,23,12,23],[10,44,12,44],[10,45,12,45],[10,46,12,46],[10,47,12,47],[10,40,12,40],[10,41,12,41],[10,42,12,42],[10,43,12,43],[10,36,12,36],[10,37,12,37],[10,38,12,38],[10,39,12,39],[10,56,12,56],[4,89,9,89],[4,101,9,101],[4,105,9,105],[4,94,9,94],[4,95,9,95],[4,96,9,96],[4,93,9,93],[4,90,9,90],[4,91,9,91],[4,92,9,92],[4,113,9,113],[4,109,9,109],[4,111,9,111],[4,112,9,112],[4,97,9,97],[4,107,9,107],[4,102,9,102],[4,103,9,103],[4,104,9,104],[4,106,9,106],[4,98,9,98],[4,99,9,99],[4,100,9,100],[4,110,9,110],[4,108,9,108],[4,78,9,78],[4,79,9,79],[4,80,9,80],[4,81,9,81],[4,74,9,74],[4,75,9,75],[4,76,9,76],[4,77,9,77],[4,70,9,70],[4,71,9,71],[4,72,9,72],[4,73,9,73],[4,66,9,66],[4,67,9,67],[4,68,9,68],[4,69,9,69],[4,62,9,62],[4,63,9,63],[4,64,9,64],[4,65,9,65],[4,58,9,58],[4,59,9,59],[4,60,9,60],[4,61,9,61],[4,54,9,54],[4,55,9,55],[4,56,9,56],[4,57,9,57],[4,50,9,50],[4,51,9,51],[4,52,9,52],[4,53,9,53],[4,46,9,46],[4,47,9,47],[4,48,9,48],[4,49,9,49],[4,42,9,42],[4,43,9,43],[4,44,9,44],[4,45,9,45],[4,38,9,38],[4,39,9,39],[4,40,9,40],[4,41,9,41],[4,34,9,34],[4,35,9,35],[4,36,9,36],[4,37,9,37],[4,30,9,30],[4,31,9,31],[4,32,9,32],[4,33,9,33],[4,26,9,26],[4,27,9,27],[4,28,9,28],[4,29,9,29],[4,23,9,23],[4,24,9,24],[4,25,9,25],[1,113,3,113],[1,111,3,111],[1,112,3,112],[1,103,3,103],[1,104,3,104],[1,97,3,97],[1,98,3,98],[4,15,9,15],[4,16,9,16],[4,17,9,17],[4,18,9,18],[4,20,9,20],[4,21,9,21],[1,109,3,109],[1,110,3,110],[1,105,3,105],[1,106,3,106],[1,107,3,107],[1,108,3,108],[1,101,3,101],[1,102,3,102],[1,99,3,99],[1,100,3,100],[1,93,3,93],[1,94,3,94],[1,95,3,95],[1,96,3,96],[1,89,3,89],[1,90,3,90],[1,91,3,91],[1,92,3,92],[1,85,3,85],[1,86,3,86],[1,87,3,87],[1,88,3,88],[1,81,3,81],[1,82,3,82],[1,83,3,83],[1,84,3,84],[1,77,3,77],[1,78,3,78],[1,79,3,79],[1,80,3,80],[1,73,3,73],[1,74,3,74],[1,75,3,75],[1,76,3,76],[1,69,3,69],[1,70,3,70],[1,71,3,71],[1,72,3,72],[1,65,3,65],[1,66,3,66],[1,67,3,67],[1,68,3,68],[1,61,3,61],[1,62,3,62],[1,63,3,63],[1,64,3,64],[1,57,3,57],[1,58,3,58],[1,59,3,59],[1,60,3,60],[1,53,3,53],[1,54,3,54],[1,55,3,55],[1,56,3,56],[1,49,3,49],[1,50,3,50],[1,51,3,51],[1,52,3,52],[1,45,3,45],[1,46,3,46],[1,47,3,47],[1,48,3,48],[1,41,3,41],[1,42,3,42],[1,43,3,43],[1,44,3,44],[1,37,3,37],[1,38,3,38],[1,39,3,39],[1,40,3,40],[1,33,3,33],[1,34,3,34],[1,35,3,35],[1,36,3,36],[1,29,3,29],[1,30,3,30],[1,31,3,31],[1,32,3,32],[1,25,3,25],[1,26,3,26],[1,27,3,27],[1,28,3,28],[1,21,3,21],[1,22,3,22],[1,23,3,23],[1,24,3,24],[1,16,3,16],[1,17,3,17],[1,18,3,18],[1,20,3,20],[1,12,3,12],[1,13,3,13],[1,14,3,14],[1,15,3,15],[4,19,9,19],[12,9,12,10],[12,4,13,4],[6,3,6,4],[11,1,11,4],[9,3,9,4],[8,3,8,4],[7,3,7,4],[12,3,13,3],[12,2,13,2],[12,1,13,1],[12,5,12,6],[12,7,13,7],[12,11,13,11],[4,13,9,13],[4,14,9,14],[10,12,12,12],[4,12,9,12],[10,15,12,15],[10,16,12,16],[10,17,12,17],[10,18,12,18],[10,13,12,13],[10,14,12,14]]}
["GHS"]
["HS",null,null,null,null,"Fachhändler:",null,null,null,null,null,null,"Anzahl"]
["HS/Z"]
["Z/HS"]
["Z","Anlagenart:",null,"GHS",null,null,null,null,null,null,null,null,"rdnete Schlüssel"]
["SP","System:",null,"SI6"]
["SI6","Kunde:"]
["2VS"]
["3VS"]
["CARAT S1","Kom.:"]
["CARAT S3","Datum:",null,null,null,null,null,null,null,null,null,null,"Übergeo"]
["CARAT S4","WILKA - VORSPRUNG DURCH QUALITÄT",null,null,null,"."]
["CARAT S5","Position","Schließungs- nummer","Türnummer","Raumbezeichnung","Stückzahl",null,"Artikel",null,"Länge",null,"Färbung "]
["TH6",null,null,null,null,"Zylinder","Schlüssel",null,"Dornmaß","A  Aussen","B   Innen",null,"ZAS"]
["2VE"]
["3VE"]
["CARAT P1"]
["CARAT P3"]
["Standard"]
["HSR"]
["STR"]
["CARAT"]
[]
[]
[]
[]
[]
[]
[]
[]
[]
[]
[]
[]
[]
[]
[]
[]
[]
[]
[]
[]
[]
[]
[]
[]
[]
[]
[]
[]
[]
[]
[]
[]
[]
[]
[]
[]
[]
[]
[]
[]
[]
[]
[]
[]
[]
[]
[]
[]
[]
[]
[]
[]
[]
[]
[]
[]
[]
[]
[]
[]
[]
[]
[]
[]
[]
[]
[]
[]
[]
[]
[]
[]
[]
[]
[]
[]
[]
[]
[]
[]
[]
[]
[]
[]
[]
[]
[]
[]
[]
[]
[]
[]
[]
[]
[]
[]
[]
[]
[]
[]
[]
[]
[]
[]
[]
[]
[]
[]
[]
[]
[]
[]
[]
[]
[]
[]
[]
[]
[]
[]
[]
[]
[]
[]
[]
[]
[]
[]
[]
[]
[]
[]
[]
[]
[]
[]
[]
[]
[]
[]
[]
[]
[]
[]
[]
[]
[]
[]
[]
[]
[]
[]
[]
[]
[]
[]
[]
[]
[]
[]
[]
[]
[]
[]
[]
[]
[]
[]
[]
[]
[]
[]
[]
[]
[]
[]
[]
[]
[]
[]
[]
[]
[]
[]
[]
[]
[]
[]
[]
[]
[]
[]
[]
[]
[]
[]
[]
[]
[]
[]
[]
[]
[]
[]
[]
[]
[]
[]
[]
[]
[]
[]
[]
[]
[]
[]
[]
[]
[]
[]
[]
[]
[]
[]
[]
[]
[]
[]
[]
[]
[]
[]
[]
[]
[]
[]
[]
[]
[]
[]
[]
[]
[]
[]
[]
[]
[]
[]
[]
[]
[]
[]
[]
[]
[]
[]
[]
[]
[]
[]
[]
[]
[]
[]
[]
[]
[]
[]
[]
[]
[]
[]
[]
[]
[]
[]
[]
[]
[]
[]
[]
[]
[]
[]
[]
[]
[]
[]
[]
[]
[]
[]
[]
[]
[]
[]
[]
[]
[]
[]
[]
[]
[]
[]
[]
[]
[]
[]
[]
[]
[]
[]
[]
[]
[]
[]
[]
[]
[]
[]
[]
[]
[]
[]
[]
[]
[]
[]
[]
[]
[]
[]
[]
[]
[]
[]
[]
[]
[]
[]
[]
[]
[]
[]
[]
[]
[]
[]
[]
[]
[]
[]
[]
[]
[]
[]
[]
[]
[]
[]
[]
[]
[]
[]
[]
[]
[]
[]
[]
[]
[]
[]
[]
[]
[]
[]
[]
[]
[]
[]
[]
[]
[]
[]
[]
[]
[]
[]
[]
[]
[]
[]
[]
[]
[]
[]
[]
[]
[]
[]
[]
[]
[]
[]
[]
[]
[]
[]
[]
[]
[]
[]
[]
[]
[]
[]
[]
[]
[]
[]
[]
[]
[]
[]
[]
[]
[]
[]
[]
[]
[]
[]
[]
[]
[]
[]
[]
[]
[]
[]
[]
[]
[]
[]
[]
[]
[]
[]
[]
[]
[]
[]
[]
[]
[]
[]
[]
[]
[]
[]
[]
[]
[]
[]
[]
[]
[]
[]
[]
[]
[]
[]
[]
[]
[]
[]
[]
[]
[]
[]
[]
[]
[]
[]
[]
[]
[]
[]
[]
[]
[]
[]
[]
[]
[]
[]
[]
[]
[]
[]
[]
[]
[]
[]
[]
[]
[]
[]
[]
[]
[]
[]
[]
[]
[]
[]
[]
[]
[]
[]
[]
[]
[]
[]
[]
[]
[]
[]
[]
[]
[]
[]
[]
[]
[]
[]
[]
[]
[]
[]
[]
[]
[]
[]
[]
[]
[]
[]
[]
[]
[]
[]
[]
[]
[]
[]
[]
[]
[]
[]
[]
[]
[]
[]
[]
[]
[]
[]
[]
[]
[]
[]
[]
[]
[]
[]
[]
[]
[]
[]
[]
[]
[]
[]
[]
[]
[]
[]
[]
[]
[]
[]
[]
[]
[]
[]
[]
[]
[]
[]
[]
[]
[]
[]
[]
[]
[]
[]
[]
[]
[]
[]
[]
[]
[]
[]
[]
[]
[]
[]
[]
[]
[]
[]
[]
[]
[]
[]
[]
[]
[]
[]
[]
[]
[]
[]
[]
[]
[]
[]
[]
[]
[]
[]
[]
[]
[]
[]
[]
[]
[]
[]
[]
[]
[]
[]
[]
[]
[]
[]
[]
[]
[]
[]
[]
[]
[]
[]
[]
[]
[]
[]
[]
[]
[]
[]
[]
[]
[]
[]
[]
[]
[]
[]
[]
[]
[]
[]
[]
[]
[]
[]
[]
[]
[]
[]
[]
[]
[]
[]
[]
[]
[]
[]
[]
[]
[]
[]
[]
[]
[]
[]
[]
[]
[]
[]
[]
[]
[]
[]
[]
[]
[]
[]
[]
[]
[]
[]
[]
[]
[]
[]
[]
[]
[]
[]
[]
[]
[]
[]
[]
[]
[]
[]
[]
[]
[]
[]
[]
[]
[]
[]
[]
[]
[]
[]
[]
[]
[]
[]
[]
[]
[]
[]
[]
[]
[]
[]
[]
[]
[]
[]
[]
[]
[]
[]
[]
[]
[]
[]
[]
[]
[]
[]
[]
[]
[]
[]
[]
[]
[]
[]
[]
[]
[]
[]
[]
[]
[]
[]
[]
[]
[]
[]
[]
[]
[]
[]
[]
[]
[]
[]
[]
[]
[]
[]
[]
[]
[]
[]
[]
[]
[]
[]
[]
[]
[]
[]
[]
[]
[]
[]
[]
[]
[]
[]
[]
[]
[]
[]
[]
[]
[]
[]
[]
[]
[]
[]
[]
[]
[]
[]
[]
[]
[]
[]
[]
[]
[]
[]
[]
[]
[]
[]
[]
[]
[]
[]
[]
[]
[]
[]
[]
[]
[]
[]
[]
[]
[]
[]
[]
[]
[]
[]
[]
[]
[]
[]
[]
[]
[]
[]
[]
[]
[]
[]
[]
[]
[]
[]
[]
[]
[]
[]
[]
[]
[]
[]
[]
[]
[]
[]
[]
[]
[]
[]
[]
[]
[]
[]
[]
[]
[]
[]
[]
[]
[]
[]
[]
[]
[]
[]
[]
[]
[]
[]
[]
[]
[]
[]
[]
[]
[]
[]
[]
[]
[]
[]
[]
[]
[]
[]
[]
[]
[]
[]
[]
[]
[]
[]
[]
[]
[]
[]
[]
[]
[]
[]
[]
[]
[]
[]
[]
[]
[]
[]
[]
[]
[]
[]
[]
[]
[]
[]
[]
[]
[]
[]
[]
[]
[]
[]
[]
[]
[]
[]
[]
[]
[]
[]
[]
[]
[]
[]
[]
[]
[]
[]
[]
[]
[]
[]
[]
[]
[]
[]
[]
[]
[]
[]
[]
[]
[]
[]
[]
[]
[]
[]
[]
[]
[]
[]
[]
[]
[]
[]
[]
[]
[]
[]
[]
[]
[]
[]
[]
[]
[]
[]
[]
[]
[]
[]
[]
[]
[]
[]
[]
[]
[]
[]
[]
[]
[]
[]
[]
[]
[]
[]
[]
[]
[]
[]
[]
[]
[]
[]
[]
[]
[]
[]
[]
[]
[]
[]
[]
[]
[]
[]
[]
[]
[]
[]
[]
[]
[]
[]
[]
[]
[]
[]
[]
[]
[]
[]
[]
[]
[]
[]
[]
[]
[]
[]
[]
[]
[]
[]
[]
[]
[]
[]
[]
[]
[]
[]
[]
[]
[]
[]
[]
[]
[]
[]
[]
[]
[]
[]
[]
[]
[]
[]
[]
[]
[]
[]
[]
[]
[]
[]
[]
[]
[]
[]
[]
[]
[]
[]
[]
[]
[]
[]
[]
[]
[]
[]
[]
[]
[]
[]
[]
[]
[]
[]
[]
[]
[]
[]
[]
[]
[]
[]
[]
[]
[]
[]
[]
[]
[]
[]
[]
[]
[]
[]
[]
[]
[]
[]
[]
[]
[]
[]
[]
[]
[]
[]
[]
[]
[]
[]
[]
[]
[]
[]
[]
[]
[]
[]
[]
[]
[]
[]
[]
[]
[]
[]
[]
[]
[]
[]
[]
[]
[]
[]
[]
[]
[]
[]
[]
[]
[]
[]
[]
[]
[]
[]
[]
[]
[]
[]
[]
[]
[]
[]
[]
[]
[]
[]
[]
[]
[]
[]
[]
[]
[]
[]
[]
[]
[]
[]
[]
[]
[]
[]
[]
[]
[]
[]
[]
[]
[]
[]
[]
[]
[]
[]
[]
[]
[]
[]
[]
[]
[]
[]
[]
[]
[]
[]
[]
[]
[]
[]
[]
[]
[]
[]
[]
[]
[]
[]
[]
[]
[]
[]
[]
[]
[]
[]
[]
[]
[]
[]
[]
[]
[]
[]
[]
[]
[]
[]
[]
[]
[]
[]
[]
[]
[]
[]
[]
[]
[]
[]
[]
[]
[]
[]
[]
[]
[]
[]
[]
[]
[]
[]
[]
[]
[]
[]
[]
[]
[]
[]
[]
[]
[]
[]
[]
[]
[]
[]
[]
[]
[]
[]
[]
[]
[]
[]
[]
[]
[]
[]
[]
[]
[]
[]
[]
[]
[]
[]
[]
[]
[]
[]
[]
[]
[]
[]
[]
[]
[]
[]
[]
[]
[]
[]
[]
[]
[]
[]
[]
[]
[]
[]
[]
[]
[]
[]
[]
[]
[]
[]
[]
[]
[]
[]
[]
[]
[]
[]
[]
[]
[]
[]
[]
[]
[]
[]
[]
[]
[]
[]
[]
[]
[]
[]
[]
[]
[]
[]
[]
[]
[]
[]
[]
[]
[]
[]
[]
[]
[]
[]
[]
[]
[]
[]
[]
[]
[]
[]
[]
[]
[]
[]
[]
[]
[]
[]
[]
[]
[]
[]
[]
[]
[]
[]
[]
[]
[]
[]
[]
[]
[]
[]
[]
[]
[]
[]
[]
[]
[]
[]
[]
[]
[]
[]
[]
[]
[]
[]
[]
[]
[]
[]
[]
[]
[]
[]
[]
[]
[]
[]
[]
[]
[]
[]
[]
[]
[]
[]
[]
[]
[]
[]
[]
[]
[]
[]
[]
[]
[]
[]
[]
[]
[]
[]
[]
[]
[]
[]
[]
[]
[]
[]
[]
[]
[]
[]
[]
[]
[]
[]
[]
[]
[]
[]
[]
[]
[]
[]
[]
[]
[]
[]
[]
[]
[]
[]
[]
[]
[]
[]
[]
[]
[]
[]
[]
[]
[]
[]
[]
[]
[]
[]
[]
[]
[]
[]
[]
[]
[]
[]
[]
[]
[]
[]
[]
[]
[]
[]
[]
[]
[]
[]
[]
[]
[]
[]
[]
[]
[]
[]
[]
[]
[]
[]
[]
[]
[]
[]
[]
[]
[]
[]
[]
[]
[]
[]
[]
[]
[]
[]
[]
[]
[]
[]
[]
[]
[]
[]
[]
[]
[]
[]
[]
[]
[]
[]
[]
[]
[]
[]
[]
[]
[]
[]
[]
[]
[]
[]
[]
[]
[]
[]
[]
[]
[]
[]
[]
[]
[]
[]
[]
[]
[]
[]
[]
[]
[]
[]
[]
[]
[]
[]
[]
[]
[]
[]
[]
[]
[]
[]
[]
[]
[]
[]
[]
[]
[]
[]
[]
[]
[]
[]
[]
[]
[]
[]
[]
[]
[]
[]
[]
[]
[]
[]
[]
[]
[]
[]
[]
[]
[]
[]
[]
[]
[]
[]
[]
[]
[]
[]
[]
[]
[]
[]
[]
[]
[]
[]
[]
[]
[]
[]
[]
[]
[]
[]
[]
[]
[]
[]
[]
[]
[]
[]
[]
[]
[]
[]
[]
[]
[]
[]
[]
[]
[]
[]
[]
[]
[]
[]
[]
[]
[]
[]
[]
[]
[]
[]
[]
[]
[]
[]
[]
[]
[]
[]
[]
[]
[]
[]
[]
[]
[]
[]
[]
[]
[]
[]
[]
[]
[]
[]
[]
[]
[]
[]
[]
[]
[]
[]
[]
[]
[]
[]
[]
[]
[]
[]
[]
[]
[]
[]
[]
[]
[]
[]
[]
[]
[]
[]
[]
[]
[]
[]
[]
[]
[]
[]
[]
[]
[]
[]
[]
[]
[]
[]
[]
[]
[]
[]
[]
[]
[]
[]
[]
[]
[]
[]
[]
[]
[]
[]
[]
[]
[]
[]
[]
[]
[]
[]
[]
[]
[]
[]
[]
[]
[]
[]
[]
[]
[]
[]
[]
[]
[]
[]
[]
[]
[]
[]
[]
[]
[]
[]
[]
[]
[]
[]
[]
[]
[]
[]
[]
[]
[]
[]
[]
[]
[]
[]
[]
[]
[]
[]
[]
[]
[]
[]
[]
[]
[]
[]
[]
[]
[]
[]
[]
[]
[]
[]
[]
[]
[]
[]
[]
[]
[]
[]
[]
[]
[]
[]
[]
[]
[]
[]
[]
[]
[]
[]
[]
[]
[]
[]
[]
[]
[]
[]
[]
[]
[]
[]
[]
[]
[]
[]
[]
[]
[]
[]
[]
[]
[]
[]
[]
[]
[]
[]
[]
[]
[]
[]
[]
[]
[]
[]
[]
[]
[]
[]
[]
[]
[]
[]
[]
[]
[]
[]
[]
[]
[]
[]
[]
[]
[]
[]
[]
[]
[]
[]
[]
[]
[]
[]
[]
[]
[]
[]
[]
[]
[]
[]
[]
[]
[]
[]
[]
[]
[]
[]
[]
[]
[]
[]
[]
[]
[]
[]
[]
[]
[]
[]
[]
[]
[]
[]
[]
[]
[]
[]
[]
[]
[]
[]
[]
[]
[]
[]
[]
[]
[]
[]
[]
[]
[]
[]
[]
[]
[]
[]
[]
[]
[]
[]
[]
[]
[]
[]
[]
[]
[]
[]
[]
[]
[]
[]
[]
[]
[]
[]
[]
[]
[]
[]
[]
[]
[]
[]
[]
[]
[]
[]
[]
[]
[]
[]
[]
[]
[]
[]
[]
[]
[]
[]
[]
[]
[]
[]
[]
[]
[]
[]
[]
[]
[]
[]
[]
[]
[]
[]
[]
[]
[]
[]
[]
[]
[]
[]
[]
[]
[]
[]
[]
[]
[]
[]
[]
[]
[]
[]
[]
[]
[]
[]
[]
[]
[]
[]
[]
[]
[]
[]
[]
[]
[]
[]
[]
[]
[]
[]
[]
[]
[]
[]
[]
[]
[]
[]
[]
[]
[]
[]
[]
[]
[]
[]
[]
[]
[]
[]
[]
[]
[]
[]
[]
[]
[]
[]
[]
[]
[]
[]
[]
[]
[]
[]
[]
[]
[]
[]
[]
[]
[]
[]
[]
[]
[]
[]
[]
[]
[]
[]
[]
[]
[]
[]
[]
[]
[]
[]
[]
[]
[]
[]
[]
[]
[]
[]
[]
[]
[]
[]
[]
[]
[]
[]
[]
[]
[]
[]
[]
[]
[]
[]
[]
[]
[]
[]
[]
[]
[]
[]
[]
[]
[]
[]
[]
[]
[]
[]
[]
[]
[]
[]
[]
[]
[]
[]
[]
[]
[]
[]
[]
[]
[]
[]
[]
[]
[]
[]
[]
[]
[]
[]
[]
[]
[]
[]
[]
[]
[]
[]
[]
[]
[]
[]
[]
[]
[]
[]
[]
[]
[]
[]
[]
[]
[]
[]
[]
[]
[]
[]
[]
[]
[]
[]
[]
[]
[]
[]
[]
[]
[]
[]
[]
[]
[]
[]
[]
[]
[]
[]
[]
[]
[]
[]
[]
[]
[]
[]
[]
[]
[]
[]
[]
[]
[]
[]
[]
[]
[]
[]
[]
[]
[]
[]
[]
[]
[]
[]
[]
[]
[]
[]
[]
[]
[]
[]
[]
[]
[]
[]
[]
[]
[]
[]
[]
[]
[]
[]
[]
[]
[]
[]
[]
[]
[]
[]
[]
[]
[]
[]
[]
[]
[]
[]
[]
[]
[]
[]
[]
[]
[]
[]
[]
[]
[]
[]
[]
[]
[]
[]
[]
[]
[]
[]
[]
[]
[]
[]
[]
[]
[]
[]
[]
[]
[]
[]
[]
[]
[]
[]
[]
[]
[]
[]
[]
[]
[]
[]
[]
[]
[]
[]
[]
[]
[]
[]
[]
[]
[]
[]
[]
[]
[]
[]
[]
[]
[]
[]
[]
[]
[]
[]
[]
[]
[]
[]
[]
[]
[]
[]
[]
[]
[]
[]
[]
[]
[]
[]
[]
[]
[]
[]
[]
[]
[]
[]
[]
[]
[]
[]
[]
[]
[]
[]
[]
[]
[]
[]
[]
[]
[]
[]
[]
[]
[]
[]
[]
[]
[]
[]
[]
[]
[]
[]
[]
[]
[]
[]
[]
[]
[]
[]
[]
[]
[]
[]
[]
[]
[]
[]
[]
[]
[]
[]
[]
[]
[]
[]
[]
[]
[]
[]
[]
[]
[]
[]
[]
[]
[]
[]
[]
[]
[]
[]
[]
[]
[]
[]
[]
[]
[]
[]
[]
[]
[]
[]
[]
[]
[]
[]
[]
[]
[]
[]
[]
[]
[]
[]
[]
[]
[]
[]
[]
[]
[]
[]
[]
[]
[]
[]
[]
[]
[]
[]
[]
[]
[]
[]
[]
[]
[]
[]
[]
[]
[]
[]
[]
[]
[]
[]
[]
[]
[]
[]
[]
[]
[]
[]
[]
[]
[]
[]
[]
[]
[]
[]
[]
[]
[]
[]
[]
[]
[]
[]
[]
[]
[]
[]
[]
[]
[]
[]
[]
[]
[]
[]
[]
[]
[]
[]
[]
[]
[]
[]
[]
[]
[]
[]
[]
[]
[]
[]
[]
[]
[]
[]
[]
[]
[]
[]
[]
[]
[]
[]
[]
[]
[]
[]
[]
[]
[]
[]
[]
[]
[]
[]
[]
[]
[]
[]
[]
[]
[]
[]
[]
[]
[]
[]
[]
[]
[]
[]
[]
[]
[]
[]
[]
[]
[]
[]
[]
[]
[]
[]
[]
[]
[]
[]
[]
[]
[]
[]
[]
[]
[]
[]
[]
[]
[]
[]
[]
[]
[]
[]
[]
[]
[]
[]
[]
[]
[]
[]
[]
[]
[]
[]
[]
[]
[]
[]
[]
[]
[]
[]
[]
[]
[]
[]
[]
[]
[]
[]
[]
[]
[]
[]
[]
[]
[]
[]
[]
[]
[]
[]
[]
[]
[]
[]
[]
[]
[]
[]
[]
[]
[]
[]
[]
[]
[]
[]
[]
[]
[]
[]
[]
[]
[]
[]
[]
[]
[]
[]
[]
[]
[]
[]
[]
[]
[]
[]
[]
[]
[]
[]
[]
[]
[]
[]
[]
[]
[]
[]
[]
[]
[]
[]
[]
[]
[]
[]
[]
[]
[]
[]
[]
[]
[]
[]
[]
[]
[]
[]
[]
[]
[]
[]
[]
[]
[]
[]
[]
[]
[]
[]
[]
[]
[]
[]
[]
[]
[]
[]
[]
[]
[]
[]
[]
[]
[]
[]
[]
[]
[]
[]
[]
[]
[]
[]
[]
[]
[]
[]
[]
[]
[]
[]
[]
[]
[]
[]
[]
[]
[]
[]
[]
[]
[]
[]
[]
[]
[]
[]
[]
[]
[]
[]
[]
[]
[]
[]
[]
[]
[]
[]
[]
[]
[]
[]
[]
[]
[]
[]
[]
[]
[]
[]
[]
[]
[]
[]
[]
[]
[]
[]
[]
[]
[]
[]
[]
[]
[]
[]
[]
[]
[]
[]
[]
[]
[]
[]
[]
[]
[]
[]
[]
[{"$f":"VLOOKUP($D$6,Systemaufstellung!$A$4:$CA$25,2,FALSE)","v":1399}]
[{"$f":"VLOOKUP($D$6,Systemaufstellung!$A$4:$CA$25,3,FALSE)","v":1400}]
[{"$f":"VLOOKUP($D$6,Systemaufstellung!$A$4:$CA$25,4,FALSE)","v":1463}]
[{"$f":"VLOOKUP($D$6,Systemaufstellung!$A$4:$CA$25,5,FALSE)","v":1408}]
[{"$f":"VLOOKUP($D$6,Systemaufstellung!$A$4:$CA$25,6,FALSE)","v":1478}]
[{"$f":"VLOOKUP($D$6,Systemaufstellung!$A$4:$CA$25,7,FALSE)","v":1479}]
[{"$f":"VLOOKUP($D$6,Systemaufstellung!$A$4:$CA$25,8,FALSE)","v":1480}]
[{"$f":"VLOOKUP($D$6,Systemaufstellung!$A$4:$CA$25,9,FALSE)","v":1481}]
[{"$f":"VLOOKUP($D$6,Systemaufstellung!$A$4:$CA$25,10,FALSE)","v":1483}]
[{"$f":"VLOOKUP($D$6,Systemaufstellung!$A$4:$CA$25,11,FALSE)","v":1488}]
[{"$f":"VLOOKUP($D$6,Systemaufstellung!$A$4:$CA$25,12,FALSE)","v":1489}]
[{"$f":"VLOOKUP($D$6,Systemaufstellung!$A$4:$CA$25,13,FALSE)","v":1405}]
[{"$f":"VLOOKUP($D$6,Systemaufstellung!$A$4:$CA$25,14,FALSE)","v":1406}]
[{"$f":"VLOOKUP($D$6,Systemaufstellung!$A$4:$CA$25,15,FALSE)","v":1407}]
[{"$f":"VLOOKUP($D$6,Systemaufstellung!$A$4:$CA$25,16,FALSE)","v":1484}]
[{"$f":"VLOOKUP($D$6,Systemaufstellung!$A$4:$CA$25,17,FALSE)","v":1473}]
[{"$f":"VLOOKUP($D$6,Systemaufstellung!$A$4:$CA$25,18,FALSE)","v":1312}]
[{"$f":"VLOOKUP($D$6,Systemaufstellung!$A$4:$CA$25,19,FALSE)","v":1319}]
[{"$f":"VLOOKUP($D$6,Systemaufstellung!$A$4:$CA$25,20,FALSE)","v":1398}]
[{"$f":"VLOOKUP($D$6,Systemaufstellung!$A$4:$CA$25,21,FALSE)","v":1410}]
[{"$f":"VLOOKUP($D$6,Systemaufstellung!$A$4:$CA$25,22,FALSE)","v":1415}]
[{"$f":"VLOOKUP($D$6,Systemaufstellung!$A$4:$CA$25,24,FALSE)","v":"B405*"}]
[{"$f":"VLOOKUP($D$6,Systemaufstellung!$A$4:$CA$25,25,FALSE)","v":"B406*"}]
[{"$f":"VLOOKUP($D$6,Systemaufstellung!$A$4:$CA$25,26,FALSE)","v":"B408*"}]
[{"$f":"VLOOKUP($D$6,Systemaufstellung!$A$4:$CA$25,27,FALSE)","v":"B410*"}]
[{"$f":"VLOOKUP($D$6,Systemaufstellung!$A$4:$CA$25,28,FALSE)","v":"B463*"}]
[{"$f":"VLOOKUP($D$6,Systemaufstellung!$A$4:$CA$25,29,FALSE)","v":"D400"}]
[{"$f":"VLOOKUP($D$6,Systemaufstellung!$A$4:$CA$25,30,FALSE)","v":"D405"}]
[{"$f":"VLOOKUP($D$6,Systemaufstellung!$A$4:$CA$25,31,FALSE)","v":"D406"}]
[{"$f":"VLOOKUP($D$6,Systemaufstellung!$A$4:$CA$25,32,FALSE)","v":"D408"}]
[{"$f":"VLOOKUP($D$6,Systemaufstellung!$A$4:$CA$25,33,FALSE)","v":"D410"}]
[{"$f":"VLOOKUP($D$6,Systemaufstellung!$A$4:$CA$25,34,FALSE)","v":"D463"}]
[{"$f":"VLOOKUP($D$6,Systemaufstellung!$A$4:$CA$25,35,FALSE)","v":"K400"}]
[{"$f":"VLOOKUP($D$6,Systemaufstellung!$A$4:$CA$25,36,FALSE)","v":"K405"}]
[{"$f":"VLOOKUP($D$6,Systemaufstellung!$A$4:$CA$25,37,FALSE)","v":"K406"}]
[{"$f":"VLOOKUP($D$6,Systemaufstellung!$A$4:$CA$25,38,FALSE)","v":"K408"}]
[{"$f":"VLOOKUP($D$6,Systemaufstellung!$A$4:$CA$25,39,FALSE)","v":"K410"}]
[{"$f":"VLOOKUP($D$6,Systemaufstellung!$A$4:$CA$25,40,FALSE)","v":"K463"}]
[{"$f":"VLOOKUP($D$6,Systemaufstellung!$A$4:$CA$25,41,FALSE)","v":"G400"}]
[{"$f":"VLOOKUP($D$6,Systemaufstellung!$A$4:$CA$25,42,FALSE)","v":"G405"}]
[{"$f":"VLOOKUP($D$6,Systemaufstellung!$A$4:$CA$25,43,FALSE)","v":"G406"}]
[{"$f":"VLOOKUP($D$6,Systemaufstellung!$A$4:$CA$25,44,FALSE)","v":"G408"}]
[{"$f":"VLOOKUP($D$6,Systemaufstellung!$A$4:$CA$25,45,FALSE)","v":"G410"}]
[{"$f":"VLOOKUP($D$6,Systemaufstellung!$A$4:$CA$25,46,FALSE)","v":"G463"}]
[{"$f":"VLOOKUP($D$6,Systemaufstellung!$A$4:$CA$25,47,FALSE)","v":2201}]
[{"$f":"VLOOKUP($D$6,Systemaufstellung!$A$4:$CA$25,48,FALSE)","v":1250}]
[{"$f":"VLOOKUP($D$6,Systemaufstellung!$A$4:$CA$25,49,FALSE)","v":1251}]
[{"$f":"VLOOKUP($D$6,Systemaufstellung!$A$4:$CA$25,50,FALSE)","v":1253}]
[{"$f":"VLOOKUP($D$6,Systemaufstellung!$A$4:$CA$25,51,FALSE)","v":500}]
[{"$f":"VLOOKUP($D$6,Systemaufstellung!$A$4:$CA$25,52,FALSE)","v":"500F"}]
[{"$f":"VLOOKUP($D$6,Systemaufstellung!$A$4:$CA$25,53,FALSE)","v":501}]
[{"$f":"VLOOKUP($D$6,Systemaufstellung!$A$4:$CA$25,54,FALSE)","v":503}]
[{"$f":"VLOOKUP($D$6,Systemaufstellung!$A$4:$CA$25,55,FALSE)","v":515}]
[{"$f":"VLOOKUP($D$6,Systemaufstellung!$A$4:$CA$25,56,FALSE)","v":560}]
[{"$f":"VLOOKUP($D$6,Systemaufstellung!$A$4:$CA$25,57,FALSE)","v":580}]
[{"$f":"VLOOKUP($D$6,Systemaufstellung!$A$4:$CA$25,58,FALSE)","v":586}]
[{"$f":"VLOOKUP($D$6,Systemaufstellung!$A$4:$CA$25,59,FALSE)","v":587}]
[{"$f":"VLOOKUP($D$6,Systemaufstellung!$A$4:$CA$25,60,FALSE)","v":2530}]
[{"$f":"VLOOKUP($D$6,Systemaufstellung!$A$4:$CA$25,61,FALSE)","v":2532}]
[{"$f":"VLOOKUP($D$6,Systemaufstellung!$A$4:$CA$25,62,FALSE)","v":2534}]
[{"$f":"VLOOKUP($D$6,Systemaufstellung!$A$4:$CA$25,63,FALSE)","v":2613}]
[{"$f":"VLOOKUP($D$6,Systemaufstellung!$A$4:$CA$25,64,FALSE)","v":516}]
[{"$f":"VLOOKUP($D$6,Systemaufstellung!$A$4:$CA$25,65,FALSE)","v":519}]
[{"$f":"VLOOKUP($D$6,Systemaufstellung!$A$4:$CA$25,66,FALSE)","v":520}]
[{"$f":"VLOOKUP($D$6,Systemaufstellung!$A$4:$CA$25,67,FALSE)","v":529}]
[{"$f":"VLOOKUP($D$6,Systemaufstellung!$A$4:$CA$25,68,FALSE)","v":530}]
[{"$f":"VLOOKUP($D$6,Systemaufstellung!$A$4:$CA$25,69,FALSE)","v":541}]
[{"$f":"VLOOKUP($D$6,Systemaufstellung!$A$4:$CA$25,70,FALSE)","v":542}]
[{"$f":"VLOOKUP($D$6,Systemaufstellung!$A$4:$CA$25,71,FALSE)","v":543}]
[{"$f":"VLOOKUP($D$6,Systemaufstellung!$A$4:$CA$25,72,FALSE)","v":544}]
[{"$f":"VLOOKUP($D$6,Systemaufstellung!$A$4:$CA$25,73,FALSE)","v":1304}]
[{"$f":"VLOOKUP($D$6,Systemaufstellung!$A$4:$CA$25,74,FALSE)","v":1307}]
[{"$f":"VLOOKUP($D$6,Systemaufstellung!$A$4:$CA$25,75,FALSE)","v":1380}]
[{"$f":"VLOOKUP($D$6,Systemaufstellung!$A$4:$CA$25,76,FALSE)","v":1401}]
[{"$f":"VLOOKUP($D$6,Systemaufstellung!$A$4:$CA$25,77,FALSE)","v":1413}]
[{"$f":"VLOOKUP($D$6,Systemaufstellung!$A$4:$CA$25,78,FALSE)","v":1477}]
[{"$f":"VLOOKUP($D$6,Systemaufstellung!$A$4:$CA$25,79,FALSE)","v":1482}]
[{"$f":"VLOOKUP($D$6,Systemaufstellung!$A$4:$DA$25,80,FALSE)","v":1486}]
[{"$f":"VLOOKUP($D$6,Systemaufstellung!$A$4:$DA$25,81,FALSE)","v":1487}]
[{"$f":"VLOOKUP($D$6,Systemaufstellung!$A$4:$DA$25,82,FALSE)","v":"E204"}]
[{"$f":"VLOOKUP($D$6,Systemaufstellung!$A$4:$DA$25,83,FALSE)","v":"E201"}]
[{"$f":"VLOOKUP($D$6,Systemaufstellung!$A$4:$DA$25,84,FALSE)","v":"E203"}]
[{"$f":"VLOOKUP($D$6,Systemaufstellung!$A$4:$DA$25,85,FALSE)","v":"E206"}]
[{"$f":"VLOOKUP($D$6,Systemaufstellung!$A$4:$DA$25,86,FALSE)","v":"E207"}]
[{"$f":"VLOOKUP($D$6,Systemaufstellung!$A$4:$DA$25,87,FALSE)","v":"E213"}]
[{"$f":"VLOOKUP($D$6,Systemaufstellung!$A$4:$DA$25,88,FALSE)","v":"E214"}]
[{"$f":"VLOOKUP($D$6,Systemaufstellung!$A$4:$DA$25,89,FALSE)","v":"E215"}]
[{"$f":"VLOOKUP($D$6,Systemaufstellung!$A$4:$DA$25,90,FALSE)","v":"E219"}]
[{"$f":"VLOOKUP($D$6,Systemaufstellung!$A$4:$DA$25,91,FALSE)","v":"E831"}]
[{"$f":"VLOOKUP($D$6,Systemaufstellung!$A$4:$DA$25,92,FALSE)","v":"E832"}]
[{"$f":"VLOOKUP($D$6,Systemaufstellung!$A$4:$DA$25,93,FALSE)","v":"E820"}]
[{"$f":"VLOOKUP($D$6,Systemaufstellung!$A$4:$DA$25,94,FALSE)","v":"E821"}]
[{"$f":"VLOOKUP($D$6,Systemaufstellung!$A$4:$DA$25,95,FALSE)","v":"E826"}]
[{"$f":"VLOOKUP($D$6,Systemaufstellung!$A$4:$DA$25,96,FALSE)","v":"E931"}]
[{"$f":"VLOOKUP($D$6,Systemaufstellung!$A$4:$DA$25,97,FALSE)","v":"E932"}]
[{"$f":"VLOOKUP($D$6,Systemaufstellung!$A$4:$DA$25,98,FALSE)","v":"E935"}]
[{"$f":"VLOOKUP($D$6,Systemaufstellung!$A$4:$DA$25,99,FALSE)","v":"E936"}]
[{"$f":"VLOOKUP($D$6,Systemaufstellung!$A$4:$DA$25,100,FALSE)","v":"E920"}]
[{"$f":"VLOOKUP($D$6,Systemaufstellung!$A$4:$DA$25,101,FALSE)","v":"E921"}]
[{"$f":"VLOOKUP($D$6,Systemaufstellung!$A$4:$DA$25,102,FALSE)","v":"E926"}]
[{"$f":"VLOOKUP($D$6,Systemaufstellung!$A$4:$DA$25,103,FALSE)","v":"E822"}]
[{"$f":"VLOOKUP($D$6,Systemaufstellung!$A$4:$DA$25,104,FALSE)","v":"E837"}]
[{"$f":"VLOOKUP($D$6,Systemaufstellung!$A$4:$DA$25,105,FALSE)","v":"E234"}]
[{"$f":"VLOOKUP($D$6,Systemaufstellung!$A$4:$FA$25,106,FALSE)","v":"E850"}]
[{"$f":"VLOOKUP($D$6,Systemaufstellung!$A$4:$FA$25,107,FALSE)","v":"E852"}]
[{"$f":"VLOOKUP($D$6,Systemaufstellung!$A$4:$FA$25,108,FALSE)","v":"E855"}]
[{"$f":"VLOOKUP($D$6,Systemaufstellung!$A$4:$FA$25,109,FALSE)","v":"E950"}]
[{"$f":"VLOOKUP($D$6,Systemaufstellung!$A$4:$FA$25,110,FALSE)","v":"E295"}]
[{"$f":"VLOOKUP($D$6,Systemaufstellung!$A$4:$FA$25,111,FALSE)","v":"E296"}]
[{"$f":"VLOOKUP($D$6,Systemaufstellung!$A$4:$FA$25,112,FALSE)","v":"E297"}]
[{"$f":"VLOOKUP($D$6,Systemaufstellung!$A$4:$FA$25,113,FALSE)","v":"SE66"}]
[{"$f":"VLOOKUP($D$6,Systemaufstellung!$A$4:$FA$25,114,FALSE)","v":"E891"}]
[{"$f":"VLOOKUP($D$6,Systemaufstellung!$A$4:$FA$25,115,FALSE)","v":"E892"}]
[{"$f":"VLOOKUP($D$6,Systemaufstellung!$A$4:$FA$25,116,FALSE)","v":"E894"}]
[{"$f":"VLOOKUP($D$6,Systemaufstellung!$A$4:$FA$25,117,FALSE)","v":"E896"}]
[{"$f":"VLOOKUP($D$6,Systemaufstellung!$A$4:$FA$25,118,FALSE)","v":"E898"}]
[{"$f":"VLOOKUP($D$6,Systemaufstellung!$A$4:$FA$25,119,FALSE)","v":"E624ST"}]
[{"$f":"VLOOKUP($D$6,Systemaufstellung!$A$4:$FA$25,120,FALSE)","v":"E624UP"}]
[{"$f":"VLOOKUP($D$6,Systemaufstellung!$A$4:$FA$25,121,FALSE)","v":"E823"}]
[{"$f":"VLOOKUP($D$6,Systemaufstellung!$A$4:$FA$25,122,FALSE)","v":"E825"}]
[{"$f":"VLOOKUP($D$6,Systemaufstellung!$A$4:$FA$25,123,FALSE)","v":"E681"}]
[{"$f":"VLOOKUP($D$6,Systemaufstellung!$A$4:$FA$25,124,FALSE)","v":"M550*"}]
[{"$f":"VLOOKUP($D$6,Systemaufstellung!$A$4:$FA$25,125,FALSE)","v":"M551*"}]
[{"$f":"VLOOKUP($D$6,Systemaufstellung!$A$4:$FA$25,126,FALSE)","v":"M552*"}]
[{"$f":"VLOOKUP($D$6,Systemaufstellung!$A$4:$FA$25,127,FALSE)","v":"M553*"}]
[{"$f":"VLOOKUP($D$6,Systemaufstellung!$A$4:$FA$25,128,FALSE)","v":"M554*"}]
[{"$f":"VLOOKUP($D$6,Systemaufstellung!$A$4:$FA$25,129,FALSE)","v":"M555*"}]
[{"$f":"VLOOKUP($D$6,Systemaufstellung!$A$4:$FA$25,130,FALSE)","v":"M556*"}]
[{"$f":"VLOOKUP($D$6,Systemaufstellung!$A$4:$FA$25,131,FALSE)","v":"M557*"}]
[{"$f":"VLOOKUP($D$6,Systemaufstellung!$A$4:$FA$25,132,FALSE)","v":"M558*"}]
[{"$f":"VLOOKUP($D$6,Systemaufstellung!$A$4:$FA$25,133,FALSE)","v":"M540"}]
[{"$f":"VLOOKUP($D$6,Systemaufstellung!$A$4:$FA$25,134,FALSE)","v":"M541"}]

{"sheet":"Artikelliste","index":3,"n_rows":187,"n_cols":20,"rows_kept":187,"cut":false,"hidden":false,"merged":[[75,20,75,22],[76,20,76,22],[84,20,84,22],[66,16,66,18],[68,16,68,18],[52,16,52,18],[48,0,48,18],[48,20,48,22],[49,16,49,18],[49,20,49,22],[50,16,50,18],[74,20,74,22],[83,20,83,22],[79,20,79,22],[81,20,81,22],[59,20,59,22],[82,16,82,18],[82,20,82,22],[173,17,173,18],[95,17,95,18],[157,16,157,18],[158,16,158,18],[102,17,102,18],[151,0,151,18],[122,17,122,18],[123,17,123,18],[115,17,115,18],[154,16,154,18],[138,16,138,18],[141,16,141,18],[148,16,148,18],[132,16,132,18],[137,16,137,18],[142,16,142,18],[149,16,149,18],[150,16,150,18],[155,16,155,18],[160,16,160,18],[153,16,153,18],[169,16,169,18],[170,16,170,18],[116,17,116,18],[77,16,77,18],[73,20,73,22],[46,16,46,18],[46,20,46,22],[70,20,70,22],[164,20,164,22],[163,16,163,18],[152,16,152,18],[34,0,34,18],[34,20,34,22],[35,16,35,18],[35,20,35,22],[36,16,36,18],[36,20,36,22],[37,16,37,18],[38,16,38,18],[39,16,39,18],[39,20,39,22],[40,16,40,18],[40,20,40,22],[80,16,80,18],[80,20,80,22],[44,16,44,18],[45,16,45,18],[21,16,21,18],[22,16,22,18],[73,16,73,18],[91,16,91,18],[19,16,19,18],[30,16,30,18],[76,16,76,18],[78,16,78,18],[81,16,81,18],[83,16,83,18],[59,16,59,18],[89,16,89,18],[75,0,75,18],[47,16,47,18],[74,16,74,18],[33,16,33,18],[84,16,84,18],[57,0,57,18],[26,16,26,18],[23,0,23,18],[61,0,61,18],[54,16,54,18],[41,0,41,18],[42,16,42,18],[71,16,71,18],[71,20,71,22],[72,16,72,18],[72,20,72,22],[62,20,62,22],[63,16,63,18],[63,20,63,22],[50,20,50,22],[53,16,53,18],[53,20,53,22],[54,20,54,22],[51,16,51,18],[57,20,57,22],[60,20,60,22],[61,20,61,22],[64,20,64,22],[65,16,65,18],[65,20,65,22],[67,16,67,18],[67,20,67,22],[60,16,60,18],[62,16,62,18],[64,16,64,18],[29,0,29,18],[29,20,29,22],[69,16,69,18],[69,20,69,22],[70,16,70,18],[32,16,32,18],[32,20,32,22],[30,20,30,22],[31,16,31,18],[31,20,31,22],[33,20,33,22],[47,20,47,22],[41,20,41,22],[42,20,42,22],[43,16,43,18],[43,20,43,22],[94,20,94,22],[167,16,167,18],[167,20,167,22],[168,16,168,18],[168,20,168,22],[120,17,120,18],[121,17,121,18],[171,16,171,18],[118,17,118,18],[119,17,119,18],[128,0,128,18],[128,20,128,22],[139,16,139,18],[138,20,138,22],[139,20,139,22],[136,16,136,18],[95,0,95,15],[165,16,165,18],[146,16,146,18],[145,16,145,18],[131,16,131,18],[9,16,9,18],[90,20,90,22],[9,20,9,22],[19,20,19,22],[15,20,15,22],[17,20,17,22],[23,20,23,22],[27,16,27,18],[27,20,27,22],[26,20,26,22],[25,16,25,18],[25,20,25,22],[56,16,56,18],[16,0,16,18],[15,16,15,18],[16,20,16,22],[17,16,17,18],[18,16,18,18],[79,16,79,18],[78,20,78,22],[24,16,24,18],[24,20,24,22],[20,16,20,18],[20,20,20,22],[28,16,28,18],[28,20,28,22],[55,0,55,18],[55,20,55,22],[56,20,56,22],[58,16,58,18],[58,20,58,22],[0,0,1,18],[2,16,3,18],[12,16,12,18],[13,16,13,18],[14,16,14,18],[14,20,14,22],[11,20,11,22],[10,20,10,22],[2,0,2,15],[11,16,11,18],[10,16,10,18],[5,16,5,18],[3,20,3,22],[4,0,4,18],[6,16,6,18],[7,16,7,18],[8,16,8,18],[133,16,133,18],[130,16,130,18],[129,16,129,18],[117,17,117,18],[102,0,102,15],[174,0,174,18],[174,20,174,22],[89,20,89,22],[85,0,85,18],[85,20,85,22],[86,16,86,18],[86,20,86,22],[87,20,87,22],[87,16,87,18],[91,20,91,22],[90,16,90,18],[171,20,171,26],[172,0,172,15],[172,17,172,18],[92,16,92,18],[92,20,92,22],[93,16,93,18],[93,20,93,22],[94,16,94,18],[175,16,175,18],[175,20,175,22],[176,16,176,18],[166,16,166,18],[140,16,140,18],[147,16,147,18],[88,16,88,18],[154,20,154,22],[161,16,161,18],[161,20,161,22],[156,16,156,18],[156,20,156,22],[159,16,159,18],[159,20,159,22],[165,20,165,22],[162,16,162,18],[162,20,162,22],[164,16,164,18],[152,20,152,22],[151,20,151,22],[143,16,143,18],[144,16,144,18],[135,16,135,18],[134,16,134,18],[177,16,177,18],[177,20,177,22],[178,16,178,18],[178,20,178,22],[179,16,179,18],[179,20,179,22],[180,16,180,18],[181,16,181,18],[182,16,182,18],[193,16,193,18],[183,16,183,18],[184,0,184,18],[184,20,184,22],[185,16,185,18],[185,20,185,22],[186,16,186,18],[186,20,186,22],[187,16,187,18],[187,20,187,22],[192,16,192,18],[191,16,191,18],[188,16,188,18],[188,20,188,22],[189,16,189,18],[190,16,190,18],[211,16,211,18],[210,16,210,18],[209,16,209,18],[208,16,208,18],[207,16,207,18],[206,16,206,18],[205,16,205,18],[204,16,204,18],[203,16,203,18],[202,16,202,18],[201,16,201,18],[200,16,200,18],[199,16,199,18],[198,16,198,18],[197,16,197,18],[196,16,196,18],[195,16,195,18],[194,16,194,18]]}
["Schließanlagen-Artikel"]
[]
["Schließanlagensysteme",null,null,null,null,null,null,null,null,null,null,null,null,null,null,null,"Beschreibung (mit * gekennzeichnete Artikel sind in Vorbereitung)"]
[]
["Doppelzylinder"]
[null,null,1399,1399,null,1399,null,null,null,null,null,null,null,null,null,null,"Profildoppelzylinder mit Doppelfunktion, Grundlänge 30/30, Messing matt vernickelt, 3 Neusilberschlüssel"]
[1400,1400,1400,1400,1400,1400,1400,1400,3600,3600,3600,3600,3600,3600,3600,2122,"Profildoppelzylinder, Grundlänge 30/30, Messing matt vernickelt, 3 Neusilberschlüssel"]
[1463,1463,1463,1463,1463,1463,1463,1463,3663,3663,3663,3663,3663,3663,3663,2163,"Profildoppelzylinder, mit Not- und Gefahrenfunktion, Grundlänge 30/30, Messing matt vernickelt, 3 Neusilberschlüssel"]
[1408,1408,1408,1408,1408,1408,1408,1408,3608,3608,3608,3608,3608,3608,3608,2108,"Profildoppelzylinder, mit Freilauffunktion für Getriebeschlösser (FZG), Grundlänge 30/30, Messing matt vernickelt, 3 Neusilberschlüssel"]
[1478,null,1478,1478,null,1478,null,null,null,null,null,null,null,null,null,2178,"Profildoppelzylinder schließbar nur mit beidseitig steckenden verschiedenen Schlüsseln, Grundlänge 30/30, Messing matt vernickelt, 3 Neusilberschlüssel"]
[1479,null,1479,1479,null,1479,null,null,null,null,null,null,null,null,null,2179,"Profildoppelzylinder, mit Gefahrenschlüssel-einrichtung, Grundlänge 30/30, Messing matt vernickelt, 3 Neusilberschlüssel"]
[1480,1480,1480,1480,1480,1480,1480,1480,3680,3680,3680,3680,3680,3680,3680,2180,"Profildoppelzylinder, Grundlänge 26/26, einseitig blind, Messing matt vernickelt, 3 Neusilberschlüssel"]
[1481,1481,1481,1481,1481,1481,1481,1481,3681,3681,3681,3681,3681,3681,3681,2181,"Profildoppelzylinder, Grundlänge 26/30, Messing matt vernickelt, 3 Neusilberschlüssel"]
[1483,1483,1483,1483,1483,1483,1483,1483,3683,3683,3683,3683,3683,3683,3683,2183,"Profildoppelzylinder, mit Not- und Gefahrenfunktion, Grundlänge 26/35, Messing matt vernickelt, 3 Neusilberschlüssel"]
[1488,1488,1488,1488,1488,1488,1488,1488,3688,3688,3688,3688,3688,3688,3688,2188,"Profilkurzzylinder, Grundlänge 26/26, Messing matt vernickelt, 3 Neusilberschlüssel"]
[1489,1489,1489,1489,1489,1489,1489,1489,3689,3689,3689,3689,3689,3689,3689,2189,"Profildoppelzylinder, Grundlänge 30/30, Messing matt vernickelt, 3 Neusilberschlüssel, eine Seite Notöffnung, andere Seite Schließfunktion"]
["Knaufzylinder"]
[1405,1405,1405,1405,1405,1405,1405,1405,3605,3605,3605,3605,3605,3605,3605,2105,"Profilknaufzylinder, Grundlänge 30/30, Messing matt vernickelt, 3 Neusilberschlüssel"]
[1406,1406,1406,1406,1406,1406,1406,1406,3606,3606,3606,3606,3606,3606,3606,3606,"Profilknaufzylinder, mit Freilauffunktion für Getriebeschlösser (FZG), Grundlänge 30/30, Messing matt vernickelt, 3 Neusilberschlüssel"]
[1407,1407,1407,1407,1407,1407,1407,1407,3607,3607,3607,3607,3607,3607,3607,2107,"Profilknaufzylinder, Grundlänge 26/26, Messing matt vernickelt, 3 Neusilberschlüssel"]
[1484,1484,1484,1484,1484,1484,1484,1484,3684,3684,3684,3684,3684,3684,3684,2184,"Profilknaufzylinder, Grundlänge 26/30, Messing matt vernickelt, 3 Neusilberschlüssel"]
[null,null,null,null,null,null,null,null,null,null,null,null,null,null,null,null,"Anti-Panik-Profilknaufzylinder, Grundlänge 30/40, für den Einsatz in Anti-Panik-Schlössern, Messing matt vernickelt, 3 Neusilberschlüssel"]
[1473,null,1473,1473,1473,1473,1473,1473,3673,3673,3673,3673,3673,3673,3673,null,"Profilknaufzylinder, mit Anti-Amok-Funktion, Grundlänge 30/30, Messing matt vernickelt, 3 Neusilberschlüssel"]
["Halbzylinder"]
[1312,1312,1312,1312,1312,1312,1312,1312,3612,3612,3612,3612,3612,3612,3612,2112,"Profilhalbzylinder, mit Freilauffunktion für Getriebeschlösser (FZG), Grundlänge 00/30, Messing matt vernickel, 3 Neusilberschlüssel"]
[1319,1319,1319,1319,1319,1319,1319,1319,3619,3619,3619,3619,3619,3619,3619,2119,"Profilhalbzylinder, mit zwei Gewindebohrungen M4 auf der Rückseite, Grundlänge 00/30, Messing matt vernickelt, 3 Neusilberschlüssel"]
[null,null,1398,1398,null,1398,null,null,null,null,null,null,null,null,null,null,"Profilhalbzylinder mit Doppelfunktion, Grundlänge 00/30, Messing matt vernickelt, 3 Neusilberschlüssel"]
[1410,1410,1410,1410,1410,1410,1410,1410,3610,3610,3610,3610,3610,3610,3610,2110,"Profilhalbzylinder, Grundlänge 00/26, Messing matt vernickelt, 3 Neusilberschlüssel"]
[1415,1415,1415,1415,1415,1415,1415,1415,3615,3615,3615,3615,3615,3615,3615,2115,"Profilhalbzylinder, mit Freilauf für Schaltungen, Grundlänge 00/30, Messing matt vernickelt, 3 Neusilberschlüssel"]
["Zylinder gemäß den Richtlinien des                          "]
[null,null,null,"B400",null,"B400*",null,null,null,"B300",null,"B300*",null,null,null,null,"Profildoppelzylinder, Grundlänge 30/30, Messing matt vernickelt, 3 Neusilberschlüssel, Ausführung VdS BZ"]
[null,null,null,"B405",null,"B405*",null,null,null,"B305",null,"B305*",null,null,null,null,"Profilknaufzylinder, Grundlänge 30/30, Messing matt vernickelt, 3 Neusilberschlüssel, Ausführung VdS BZ"]
[null,null,null,"B410",null,"B410*",null,null,null,"B310",null,"B310*",null,null,null,null,"Profilhalbzylinder, Grundlänge 00/30, Messing matt vernickelt, 3 Neusilberschlüssel, Ausführung VdS BZ"]
[null,null,null,"B463",null,"B463*",null,null,null,"B363",null,"B363*",null,null,null,null,"Profildoppelzylinder, mit Not- und Gefahrenfunktion, Grundlänge 30/30, Messing matt vernickelt, 3 Neusilberschlüssel, Ausführung VdS BZ"]
["Zylinder zertifiziert nach DIN 18252 / DIN EN 1303                         "]
[null,null,null,"D400",null,"D400","D400","D400",null,null,"D300","D300","D300","D300",null,null,"Profildoppelzylinder, Grundlänge 30/30, Messing matt vernickelt, 3 Neusilberschlüssel, Ausführung DIN"]
[null,null,null,"D405",null,"D405","D405","D405",null,null,"D305","D305","D305","D305",null,null,"Profilknaufzylinder, Grundlänge 30/30, Messing matt vernickelt, 3 Neusilberschlüssel, Ausführung DIN"]
[null,null,null,"D406",null,"D406","D406","D406",null,null,"D306","D306","D306","D306",null,null,"Profilknaufzylinder, mit Freilauffunktion für Getriebeschlösser (FZG), Grundlänge 30/30, Messing matt vernickelt, 3 Neusilberschlüssel, Ausführung DIN"]
[null,null,null,"D408",null,"D408","D408","D408",null,null,"D308","D308","D308","D308",null,null,"Profildoppelzylinder, mit Freilauffunktion für Getriebeschlösser (FZG), Grundlänge 30/30, Messing matt vernickelt, 3 Neusilberschlüssel, Ausführung DIN"]
[null,null,null,"D410",null,"D410","D410","D410",null,null,"D310","D310","D310","D310",null,null,"Profilhalbzylinder, Grundlänge 00/30, Messing matt vernickelt, 3 Neusilberschlüssel, Ausführung DIN"]
[null,null,null,"D463",null,"D463","D463","D463",null,null,"D363","D363","D363","D363",null,null,"Profildoppelzylinder, mit Not- und Gefahrenfunktion, Grundlänge 30/30, Messing matt vernickelt, 3 Neusilberschlüssel, Ausführung DIN"]
["Zylinder gemäß den Richtlinien des                          (nur STR, HSR nicht möglich)"]
[null,null,"K400","K400","K400","K400","K400","K400",null,"K360",null,"K360","K360","K360","K360",null,"Profildoppelzylinder, Grundlänge 30/30, Messing matt vernickelt, 3 Neusilberschlüssel, ABH SKG beidseitig"]
[null,null,"K405","K405","K405","K405","K405","K405",null,"K365",null,"K365","K365","K365","K365",null,"Profilknaufzylinder, Grundlänge 30/30, Messing matt vernickelt, 3 Neusilberschlüssel,  ABH SKG beidseitig"]
[null,null,"K406","K406","K406","K406","K406","K406",null,"K366",null,"K366","K366","K366","K366",null,"Profilknaufzylinder, mit Freilauffunktion für Getriebeschlösser (FZG), Grundlänge 30/30, Messing matt vernickelt, 3 Neusilberschlüssel, ABH SKG beidseitig"]
[null,null,"K408","K408","K408","K408","K408","K408",null,"K368",null,"K368","K368","K368","K368",null,"Profildoppelzylinder, mit Freilauffunktion für Getriebeschlösser (FZG), Grundlänge 30/30, Messing matt vernickelt, 3 Neusilberschlüssel, ABH SKG beidseitig"]
[null,null,"K410","K410","K410","K410","K410","K410",null,"K361",null,"K361","K361","K361","K361",null,"Profilhalbzylinder, Grundlänge 00/26, Messing matt vernickelt, 3 Neusilberschlüssel,  ABH SKG beidseitig"]
[null,null,"K463","K463","K463","K463","K463","K463",null,"K363",null,"K363","K363","K363","K363",null,"Profildoppelzylinder, mit Not- und Gefahrenfunktion, Grundlänge 30/30, Messing matt vernickelt, 3 Neusilberschlüssel,  ABH SKG beidseitig"]
["Zylinder gemäß den Richtlinien des                         "]
[null,null,null,"G400","G400","G400","G400","G400",null,"G360",null,"G360","G360","G360","G360",null,"Profildoppelzylinder, Grundlänge 30/30, Messing matt vernickelt, 3 Neusilberschlüssel, ABH SKG einseitig"]
[null,null,null,"G405","G405","G405","G405","G405",null,"G365",null,"G365","G365","G365","G365",null,"Profilknaufzylinder, Grundlänge 30/30, Messing matt vernickelt, 3 Neusilberschlüssel,  ABH SKG einseitig"]
[null,null,null,"G406","G406","G406","G406","G406",null,"G366",null,"G366","G366","G366","G366",null,"Profilknaufzylinder, mit Freilauffunktion für Getriebeschlösser (FZG), Grundlänge 30/30, Messing matt vernickelt, 3 Neusilberschlüssel, ABH SKG beidseitig"]
[null,null,null,"G408","G408","G408","G408","G408",null,"G368",null,"G368","G368","G368","G368",null,"Profildoppelzylinder, mit Freilauffunktion für Getriebeschlösser (FZG), Grundlänge 30/30, Messing matt vernickelt, 3 Neusilberschlüssel, ABH SKG beidseitig"]
[null,null,null,"G410","G410","G410","G410","G410",null,"G361",null,"G361","G361","G361","G361",null,"Profilhalbzylinder, Grundlänge 00/26, Messing matt vernickelt, 3 Neusilberschlüssel,  ABH SKG einseitig"]
[null,null,null,"G463","G463","G463","G463","G463",null,"G363",null,"G363","G363","G363","G363",null,"Profildoppelzylinder, mit Not- und Gefahrenfunktion, Grundlänge 30/30, Messing matt vernickelt, 3 Neusilberschlüssel,  ABH SKG einseitig"]
["Vorhangschloß"]
[2201,2201,2201,2201,2201,2201,2201,2201,3601,3601,3601,3601,3601,3601,3601,2101,"Schweres Vorhangschloß, Schloßkörper Messing gebürstet, 30er oder 80er Niro-Bügel, 3 Neusilberschlüssel"]
["Hebelzylinder"]
[1250,1250,1250,1250,1250,1250,1250,1250,3650,3650,3650,3650,3650,3650,3650,2150,"Zylinder-Hebelschloß, Messing matt vernickelt, 3 Neusilberschlüssel"]
[1251,1251,1251,1251,1251,1251,1251,1251,3651,3651,3651,3651,3651,3651,3651,2151,"Zylinder-Hebelschloß, Schlüssel im offenem bzw. geschlossenem Zustand abziehbar, Messing matt vernickelt, 3 Neusilberschlüssel"]
[1253,1253,1253,1253,1253,1253,1253,1253,3657,3657,3657,3657,3657,3657,3657,2157,"Zylinder-Hebelschloß, Messing matt vernickelt, 3 Neusilberschlüssel, für Renz-Briefkästen, mit Hebel 50 62 059 und Befestigungsrundmutter"]
["Rundzylinder"]
[500,500,500,500,500,500,500,500,3652,3652,3652,3652,3652,3652,3652,2152,"Aussenzylinder für Kastenschlösser"]
["500F","500F","500F","500F","500F","500F","500F","500F",3632,3632,3632,3632,3632,3632,3632,2132,"Rundzylinder Durchmesser 32mm für Garagentore"]
[501,501,501,501,null,501,501,501,null,null,null,null,null,null,null,2155,"Aussenzylinder für Kastenschloss Nr. 2611"]
[503,503,503,503,null,503,503,503,3603,3603,3603,3603,3603,3603,null,2103,"Aussenzylinder für Kastenschloss Nr. 2621"]
[515,515,515,515,515,515,515,515,3685,3685,3685,3685,3685,3685,3685,2185,"Rundzylinder für Kastenschlösser"]
[560,560,560,560,null,560,560,560,3660,3660,3660,3660,3660,3660,null,2160,"Kontaktzylinder für Aufzüge"]
[580,580,580,580,580,580,580,580,3690,3690,3690,3690,3690,3690,3690,2190,"Rundzylinder für Kastenschlösser"]
[586,586,586,586,null,586,586,586,null,null,null,null,null,null,null,2154,"Rundzylinder Durchmesser 30mm für Garagentore aus Stahl"]
[587,587,587,587,null,587,587,587,null,null,null,null,null,null,null,2153,"Rundzylinder Durchmesser 30mm für Garagentore aus Holz"]
[2530,2530,2530,2530,null,2530,2530,2530,3616,3616,3616,3616,3616,3616,null,2116,"Aussen- und Innenzylinder für Zusatzschloss Nr. 2516"]
[2532,2532,2532,2532,null,2532,2532,2532,3624,3624,3624,3624,3624,3624,null,2124,"Aussen- und Innenzylinder für Kastenschloss Nr. 542 und Nr. 2524"]
[2534,2534,2534,2534,null,2534,2534,2534,3656,3656,3656,3656,3656,3656,null,2156,"Aussen- und Innenzylinder für Nr. 2616"]
[2613,2613,2613,2613,null,2613,2613,2613,3613,3613,3613,3613,3613,3613,null,2113,"Aussen- und Innenzylinder für Nr. 2626"]
["Möbelschlösser und Zubehör"]
[516,516,516,516,516,516,516,516,516,516,516,516,516,516,516,516,"Drehstangenschloss 40mm Dorn für geteilte Drehstangen"]
[519,519,519,519,519,519,519,519,519,519,519,519,519,519,519,519,"Möbelriegelschloss 40mm Dorn"]
[520,520,520,520,520,520,520,520,520,520,520,520,520,520,520,520,"feststehende Olive, matt vernickelt"]
[529,529,529,529,529,529,529,529,529,529,529,529,529,529,529,529,"Olive abschließbar für Halbzylinder"]
[530,530,530,530,530,530,530,530,530,530,530,530,530,530,530,530,"drehbare Olive, matt vernickelt"]
[541,541,541,541,541,541,541,541,541,541,541,541,541,541,541,541,"Hebelschloß für Halbzylinder, ohne Schließzwang"]
[542,542,542,542,542,542,542,542,542,542,542,542,542,542,542,542,"Hebelschloß für Halbzylinder, mit Schließzwang"]
[543,543,543,543,543,543,543,543,543,543,543,543,543,543,543,543,"Hebelschloß (Schließweg 180°)"]
[544,544,544,544,544,544,544,544,544,544,544,544,544,544,544,544,"Zubehörset für Art. 541 - 543 (Glastürverschluss)"]
["Zylinder ohne Schließfunktion"]
[1304,1304,1304,1304,1304,1304,1304,1304,1304,1304,1304,1304,1304,1304,1304,1304,"Knaufzylinder, beidseitig Knauf, Messing matt vernickelt"]
[1307,1307,1307,1307,1307,1307,1307,1307,1307,1307,1307,1307,1307,1307,1307,1307,"Knaufzylinder, asymetrisch, beidseitig Knauf, Messing matt vernickelt"]
[1380,1380,1380,1380,1380,1380,1380,1380,1380,1380,1380,1380,1380,1380,1380,1380,"Knaufzylinder, einseitig Knauf, andere Seite blind, Messing matt vernickelt"]
[1401,1401,1401,1401,1401,1401,1401,1401,1401,1401,1401,1401,1401,1401,1401,1401,"Profilblindzylinder, Grundlänge 26/26 oder 00/26, Messing matt vernickelt"]
[1413,1413,1413,1413,1413,1413,1413,1413,1413,1413,1413,1413,1413,1413,1413,1413,"Knaufhalbzylinder, Grundlänge 00/30, Messing matt vernickelt"]
[1477,1477,1477,1477,1477,1477,1477,1477,1477,1477,1477,1477,1477,1477,1477,1477,"Knaufzylinder mit optischer Verschlussanzeige, Grundlänge 30/30, Messing matt vernickelt"]
[1482,1482,1482,1482,1482,1482,1482,1482,1482,1482,1482,1482,1482,1482,1482,1482,"Doppelzylinder, Grundlänge 30/30, Messing matt vernickelt, einseitig blind, andere Seite Notöffnung"]
[1486,1486,1486,1486,1486,1486,1486,1486,1486,1486,1486,1486,1486,1486,1486,1486,"Doppelzylinder, Grundlänge 30/30, Messing matt vernickelt, beidseitig Notöffnung"]
[1487,1487,1487,1487,1487,1487,1487,1487,1487,1487,1487,1487,1487,1487,1487,1487,"Knaufzylinder, Grundlänge 30/30, Messing matt vernickelt, einseitig Notöffnung, andere Seite Knauf"]
["Zylinderfärbungen",null,null,null,null,null,null,null,null,null,null,null,null,null,null,null,"Code (Schließplan Spalte Färbung)","Beschreibung"]
["X","X","X","X","X","X","X","X","X","X","X","X","X","X","X","X","1","Messing matt vernickelt (Standard)"]
["X","X","X","X","X","X","X","X","X","X","X","X","X","X","X","X","3","Messing poliert"]
["X","X","X","X","X","X","X","X","X","X","X","X","X","X","X","X","4","Messing matt gebürstet"]
["X","X","X","X","X","X","X","X","X","X","X","X","X","X","X","X","5","Messing brüniert"]
["X","X","X","X","X","X","X","X","X","X","X","X","X","X","X","X","6","Messing matt verchromt"]
["X","X","X","X","X","X","X","X","X","X","X","X","X","X","X","X","7","Messing poliert verchromt"]
["Zusatzausstattungen für mechanische Schließanlagen (Auszug)",null,null,null,null,null,null,null,null,null,null,null,null,null,null,null,"Code (Schließplan Spalte ZAS)","Beschreibung"]
["X","X","X","X","X","X","X","X","X","X","X","X","X","X","X","X","01","seewasserbeständige Ausführung"]
["X","X","X","X","X","X","X","X",null,null,null,null,null,null,null,null,"03"," verschleissarme Ausführung"]
["X","X","X","X","X","X","X","X","X","X","X","X","X","X","X","X","04","Knauf kurze Seite"]
["X","X","X","X","X","X","X","X","X","X","X","X","X","X","X","X","05","Knauf lange Seite"]
["X",null,"X","X",null,"X",null,null,null,null,null,null,null,null,null,null,"08","Gefahrenschlüssel kurze Seite"]
["X",null,"X","X",null,"X",null,null,null,null,null,null,null,null,null,null,"09","Gefahrenschlüssel lange Seite"]
["X","X","X","X","X","X","X","X",null,null,null,null,null,null,null,null,"3","ABH I beidseitig"]
["X","X","X","X","X","X","X","X",null,null,null,null,null,null,null,"X","4","ABH III kurze Seite"]
["X","X","X","X","X","X","X","X",null,null,null,null,null,null,null,"X","5","ABH III lange Seite"]
["X","X","X","X","X","X","X","X",null,null,null,null,null,null,null,"X","6","ABH III beidseitig"]
["X","X","X","X","X","X","X","X",null,null,null,null,null,null,null,null,"65","ABH V beidseitig"]
["X","X","X","X","X","X","X","X",null,null,null,null,null,null,null,null,"45"," ABH V kurze Seite"]
["X","X","X","X","X","X","X","X",null,null,null,null,null,null,null,null,"55","ABH V lange Seite"]
[null,null,null,null,null,null,null,null,"X","X","X","X","X","X","X",null,"81","ABH IX kurze Seite"]
[null,null,null,null,null,null,null,null,"X","X","X","X","X","X","X",null,"82","ABH IX lange Seite"]
[null,null,null,null,null,null,null,null,"X","X","X","X","X","X","X",null,"83","ABH IX beidseitig"]
[null,null,null,null,null,null,null,null,"X","X","X","X","X","X","X",null,"91","ABH X kurze Seite"]
[null,null,null,null,null,null,null,null,"X","X","X","X","X","X","X",null,"92","ABH X lange Seite"]
[null,null,null,null,null,null,null,null,"X","X","X","X","X","X","X",null,"93"," ABH X beidseitig"]
[null,null,"X",null,null,null,null,null,null,null,null,null,null,null,null,null,"7","PRO für Halbzylinder und Knaufzylinder"]
[null,null,"X",null,null,null,null,null,null,null,null,null,null,null,null,null,"8","PRO für Doppelzylinder"]
[null,null,null,"X","X","X","X","X","X","X","X","X","X","X","X",null,"A1","Ziehschutzspange"]
["X","X","X","X","X","X","X","X","X","X","X","X","X","X","X","X","S2","Biffar-Schließnase"]
["X","X","X","X","X","X","X","X","X","X","X","X","X","X","X","X","S3","Ritzel 10 Zähne (Multilock)"]
["X","X","X","X","X","X","X","X","X","X","X","X","X","X","X","X","S4","Ritzel 18 Zähne"]
["elektronische Zylinder, Leser und Beschläge \"Serie easy\""]
["E204","E204","E204","E204","E204","E204","E204","E204","E204","E204","E204","E204","E204","E204","E204","E204","Elektronischer Doppelknaufzylinder, Serie easy2.0, Grundlänge 30/30, Messing matt vernickelt, aussen Elektronik, innen mechanischer Knauf, IP67"]
["E203","E203","E203","E203","E203","E203","E203","E203","E203","E203","E203","E203","E203","E203","E203","E203","Elektronischer Doppelknaufzylinder, Serie easy2.0, Grundlänge 30/30, Messing matt vernickelt, aussen Elektronik, innen Blindkern, IP67"]
["E201","E201","E201","E201","E201","E201","E201","E201","E201","E201","E201","E201","E201","E201","E201","E201","Elektronischer Doppelknaufzylinder Classic, Serie easy2.0, Grundlänge 30/30, Messing matt vernickelt, aussen Elektronik, innen mechanischer Knauf, IP44"]
["E206","E206","E206","E206","E206","E206","E206","E206","E206","E206","E206","E206","E206","E206","E206","E206","Elektronischer Doppelknaufzylinder, Serie easy2.0, Grundlänge 30/30, Messing matt vernickelt, aussen Elektronik, innen mechanische Schließung, IP67"]
["E207","E207","E207","E207","E207","E207","E207","E207","E207","E207","E207","E207","E207","E207","E207","E207","Elektronischer Doppelknaufzylinder, Serie easy2.0, Grundlänge 30/30, Messing matt vernickelt, beidseitig Elektronik, IP67"]
["E213","E213","E213","E213","E213","E213","E213","E213","E213","E213","E213","E213","E213","E213","E213","E213","Elektronischer Halbzylinder, Serie easy2.0, Grundlänge 00/30, Messing matt vernickelt, aussen Elektronik, IP67"]
["E214","E214","E214","E214","E214","E214","E214","E214","E214","E214","E214","E214","E214","E214","E214","E214","Elektronischer Doppelknaufzylinder, für Anti-Panik-Türen, Serie easy2.0, Grundlänge 30/35, Messing matt vernickelt, aussen Elektronik, innen mechanischer Knauf, IP67"]
["E215","E215","E215","E215","E215","E215","E215","E215","E215","E215","E215","E215","E215","E215","E215","E215","Elektronischer Doppelknaufzylinder, für Anti-Panik-Türen, Serie easy2.0, Grundlänge 30/35, Messing matt vernickelt, aussen Elektronik, innen Blindkern, IP67"]
["E219","E219","E219","E219","E219","E219","E219","E219","E219","E219","E219","E219","E219","E219","E219","E219","Elektronischer Halbzylinder, Serie easy2.0, Grundlänge 00/30, Messing matt vernickelt, aussen Elektronik, IP67, mit zwei Gewindebohrungen M4 auf der Rückseite"]
["E831","E831","E831","E831","E831","E831","E831","E831","E831","E831","E831","E831","E831","E831","E831","E831","Elektronikleser, schmale Abdeckkappe"]
["E832","E832","E832","E832","E832","E832","E832","E832","E832","E832","E832","E832","E832","E832","E832","E832","Elektronikleser, breite Abdeckkappe"]
["E820","E820","E820","E820","E820","E820","E820","E820","E820","E820","E820","E820","E820","E820","E820","E820","Elektronischer Beschlag"]
["E821","E821","E821","E821","E821","E821","E821","E821","E821","E821","E821","E821","E821","E821","E821","E821","Elektronischer Beschlag, für den Einsatz in Brand- und Rauchschutztüren."]
["E826","E826","E826","E826","E826","E826","E826","E826","E826","E826","E826","E826","E826","E826","E826","E826","Elektronischer Beschlag, mit beidseitiger elektronischer Abfrage"]
["E931","E931","E931","E931","E931","E931","E931","E931","E931","E931","E931","E931","E931","E931","E931","E931","Elektronikleser, schmale Abdeckkappe System \"elink\""]
["E932","E932","E932","E932","E932","E932","E932","E932","E932","E932","E932","E932","E932","E932","E932","E932","Elektronikleser, breite Abdeckkappe System \"elink\""]
["E935","E935","E935","E935","E935","E935","E935","E935","E935","E935","E935","E935","E935","E935","E935","E935","Zusatzleser, schmale Abdeckkappe System \"elink\""]
["E936","E936","E936","E936","E936","E936","E936","E936","E936","E936","E936","E936","E936","E936","E936","E936","Zusatzleser, breite Abdeckkappe System \"elink\""]
["E920","E920","E920","E920","E920","E920","E920","E920","E920","E920","E920","E920","E920","E920","E920","E920","Elektronischer Beschlag"]
["E921","E921","E921","E921","E921","E921","E921","E921","E921","E921","E921","E921","E921","E921","E921","E921","Elektronischer Beschlag, für den Einsatz in Brand- und Rauchschutztüren."]
["E926","E926","E926","E926","E926","E926","E926","E926","E926","E926","E926","E926","E926","E926","E926","E926","Elektronischer Beschlag, mit beidseitiger elektronischer Abfrage"]
["E822","E822","E822","E822","E822","E822","E822","E822","E822","E822","E822","E822","E822","E822","E822","E822","Mechanische Innen-Rosettengarnitur für E821/E921"]
["Zubehör elektronische Zylinder, Leser und Beschläge \"Serie easy\""]
["E837","E837","E837","E837","E837","E837","E837","E837","E837","E837","E837","E837","E837","E837","E837","E837","Aufputzgehäuse für Lesersteuerung weiß"]
["E234","E234","E234","E234","E234","E234","E234","E234","E234","E234","E234","E234","E234","E234","E234","E234","Montagewerkzeug für easy2.0"]
["E850","E850","E850","E850","E850","E850","E850","E850","E850","E850","E850","E850","E850","E850","E850","E850","Basic-Software mit tragbarem Programmiergerät, inkl. USB-Anschlusskabel"]
["E852","E852","E852","E852","E852","E852","E852","E852","E852","E852","E852","E852","E852","E852","E852","E852","Basic lite-Software mit tragbarem Programmiergerät, inkl. USB-Anschlusskabel"]
["E855","E855","E855","E855","E855","E855","E855","E855","E855","E855","E855","E855","E855","E855","E855","E855","Hotel-Software, inkl. Kodierstation"]
["E950","E950","E950","E950","E950","E950","E950","E950","E950","E950","E950","E950","E950","E950","E950","E950","elink-Software, inkl. Programmiergerät"]
["E295","E295","E295","E295","E295","E295","E295","E295","E295","E295","E295","E295","E295","E295","E295","E295","Programmierkarte"]
["E296","E296","E296","E296","E296","E296","E296","E296","E296","E296","E296","E296","E296","E296","E296","E296","Löschkarte für Transpondermedium"]
["E297","E297","E297","E297","E297","E297","E297","E297","E297","E297","E297","E297","E297","E297","E297","E297","Daueraufkarte"]
["SE24","SE24","SE24","SE60","SE65","SE66","SE66","SE66","SE66","SE66","SE66","SE66","SE66","SE66","SE35","E241","Elektronikschlüssel"]
["E891","E891","E891","E891","E891","E891","E891","E891","E891","E891","E891","E891","E891","E891","E891","E891","Schlüsselanhänger-Transponder"]
["E892","E892","E892","E892","E892","E892","E892","E892","E892","E892","E892","E892","E892","E892","E892","E892","Schlüsselanhänger-Transponder Komfort-Ausführung"]
["E894","E894","E894","E894","E894","E894","E894","E894","E894","E894","E894","E894","E894","E894","E894","E894","Transponderkarte"]
["E896","E896","E896","E896","E896","E896","E896","E896","E896","E896","E896","E896","E896","E896","E896","E896","Transponderscheibe transparent oder selbstklebend weiß"]
["E898","E898","E898","E898","E898","E898","E898","E898","E898","E898","E898","E898","E898","E898","E898","E898","Schlüsselanhänger in verschiedenen Ausführungen, Standard+, Premium (mind. Bestellmenge 5 Stück)"]
["E624ST","E624ST","E624ST","E624ST","E624ST","E624ST","E624ST","E624ST","E624ST","E624ST","E624ST","E624ST","E624ST","E624ST","E624ST","E624ST","Steckernetzteil für externe Versorgung von Leser und Zylinder"]
["E624UP","E624UP","E624UP","E624UP","E624UP","E624UP","E624UP","E624UP","E624UP","E624UP","E624UP","E624UP","E624UP","E624UP","E624UP","E624UP","Netzteil für Einbau in UP-Dose für externe Versorgung von Leser und Zylinder"]
["E823","E823","E823","E823","E823","E823","E823","E823","E823","E823","E823","E823","E823","E823","E823","E823","Notstrombox für Beschlag"]
["E825","E825","E825","E825","E825","E825","E825","E825","E825","E825","E825","E825","E825","E825","E825","E825","Unterlegblech Edelstahl gebürstet für Beschlag"]
["E680","E680","E680","E680","E680","E680","E680","E680","E680","E680","E680","E680","E680","E680","E680","E680","Kabelübergang, galvanisch verchromt"]
["Zusatzausstattungen für elektronische Schließanlagen (Auszug)",null,null,null,null,null,null,null,null,null,null,null,null,null,null,null,"Code (Schließplan Spalte ZAS)","Beschreibung"]
["X","X","X","X","X","X","X","X","X","X","X","X","X","X","X","X","V","verlängerte Achse"]
["Motorzylinder MZ02"]
[null,"M550","M550","M550","M550","M550","M550","M550","M550","M550","M550*","M550*","M550*","M550*","M550",null,"Motorzylinder MZ02, Grundlänge 30/30, inkl. Steuerung, Netzteil, Kabel und Türkontakt, matt vernickelt",null,null,"*"]
[null,"M551","M551","M551","M551","M551","M551","M551","M551","M551","M551*","M551*","M551*","M551*","M551",null,"Motorzylinder MZ02, Grundlänge 30/30, inkl. Steuerung, Netzteil, Kabel und Türkontakt, F1 ähnlich",null,null,"*"]
[null,"M552","M552","M552","M552","M552","M552","M552","M552","M552","M552*","M552*","M552*","M552*","M552",null,"Motorzylinder MZ02, Grundlänge 30/30, inkl. Steuerung, Netzteil, Kabel und Türkontakt, Edelstahl ähnlich",null,null,"*"]
[null,"M553","M553","M553","M553","M553","M553","M553","M553","M553","M553*","M553*","M553*","M553*","M553",null,"Motorzylinder MZ02, Grundlänge 30/30, inkl. Steuerung, Netzteil, Kabel und Türkontakt, Messing poliert",null,null,"*"]
["M554","M554","M554","M554","M554","M554","M554","M554","M554","M554","M554*","M554*","M554*","M554*","M554","M554","Motorzylinder MZ02, Grundlänge 30/30, inkl. Steuerung, Netzteil, Kabel und Türkontakt, matt vernickelt, mit Blindzylinder",null,null,"*"]
["M555","M555","M555","M555","M555","M555","M555","M555","M555","M555","M555*","M555*","M555*","M555*","M555","M555","Motorzylinder MZ02, Grundlänge 30/30, inkl. Steuerung, Netzteil, Kabel und Türkontakt, F1 ähnlich, mit Blindzylinder",null,null,"*"]
["M556","M556","M556","M556","M556","M556","M556","M556","M556","M556","M556*","M556*","M556*","M556*","M556","M556","Motorzylinder MZ02, Grundlänge 30/30, inkl. Steuerung, Netzteil, Kabel und Türkontakt, Edelstahl ähnlich, mit Blindzylinder",null,null,"*"]
["M557","M557","M557","M557","M557","M557","M557","M557","M557","M557","M557*","M557*","M557*","M557*","M557","M557","Motorzylinder MZ02, Grundlänge 30/30, inkl. Steuerung, Netzteil, Kabel und Türkontakt, Messing poliert, mit Blindzylinder",null,null,"*"]
[null,"M558","M558","M558","M558","M558","M558","M558","M558","M558","M558*","M558*","M558*","M558*","M558",null,"Motorzylinder MZ02, Grundlänge 30/30, inkl. Steuerung, Netzteil, Kabel und Türkontakt, matt vernickelt, ohne Innenknauf",null,null,"*"]
["Zubehör Motorzylinder MZ02"]
["M540","M540","M540","M540","M540","M540","M540","M540","M540","M540","M540","M540","M540","M540","M540","M540","Wochenzeitschaltuhr für MZ02"]
["M541","M541","M541","M541","M541","M541","M541","M541","M541","M541","M541","M541","M541","M541","M541","M541","Warntonsirene"]

{"sheet":"Systemaufstellung","index":4,"n_rows":20,"n_cols":180,"rows_kept":20,"cut":false,"hidden":true,"merged":[]}
[]
[]
[]
["Standard",1400,1463,1408,1478,1479,1480,1481,1483,1488,1489,1405,1406,1407,1484,1473,1312,1319,1410,1415,2201,1250,1251,1253,500,"500F",501,503,515,560,580,586,587,2530,2532,2534,2613,516,519,520,529,530,541,542,543,544,1304,1307,1380,1401,1413,1477,1482,"E204","E201","E203","E207","E213","E214","E215","E219","E831","E832","E820","E821","E826","E931","E932","E935","E936","E920","E921","E926","E822","E837","E234","E850","E852","E855","E950","E295","E296","E297","SE24","E891","E892","E894","E896","E898","E624ST","E624UP","E823","E825","E680"]
["CARAT",1400,1463,1408,1480,1481,1483,1488,1489,1405,1406,1407,1484,1312,1319,1410,1415,2201,1250,1251,1253,500,"500F",501,503,515,560,580,586,587,2530,2532,2534,2613,516,519,520,529,530,541,542,543,544,1304,1307,1380,1401,1413,1477,1482,"E204","E201","E203","E206","E207","E213","E214","E215","E219","E831","E832","E820","E821","E826","E931","E932","E935","E936","E920","E921","E926","E822","E837","E234","E850","E852","E855","E950","E295","E296","E297","SE24","E891","E892","E894","E896","E898","E624ST","E624UP","E823","E825","E680"]
["HSR",1399,1400,1463,1408,1478,1479,1480,1481,1483,1488,1489,1405,1406,1407,1484,1473,1312,1319,1398,1410,1415,2201,1250,1251,1253,500,"500F",501,503,515,560,580,586,587,2530,2532,2534,2613,516,519,520,529,530,541,542,543,544,1304,1307,1380,1401,1413,1477,1482,"E204","E201","E203","E206","E207","E213","E214","E215","E219","E831","E832","E820","E821","E826","E931","E932","E935","E936","E920","E921","E926","E822","E837","E234","E850","E852","E855","E950","E295","E296","E297","SE24","E891","E892","E894","E896","E898","E624ST","E624UP","E823","E825","E680"]
["STR",1399,1400,1463,1408,1478,1479,1480,1481,1483,1488,1489,1405,1406,1407,1484,1473,1312,1319,1398,1410,1415,"K400","K405","K406","K408","K410","K463",2201,1250,1251,1253,500,"500F",501,503,515,560,580,586,587,2530,2532,2534,2613,516,519,520,529,530,541,542,543,544,1304,1307,1380,1401,1413,1477,1482,"E204","E201","E203","E206","E207","E213","E214","E215","E219","E831","E832","E820","E821","E826","E931","E932","E935","E936","E920","E921","E926","E822","E837","E234","E850","E852","E855","E950","E295","E296","E297","SE60","E891","E892","E894","E896","E898","E624ST","E624UP","E823","E825","E680"]
["TH6",1399,1400,1463,1408,1478,1479,1480,1481,1483,1488,1489,1405,1406,1407,1484,1473,1312,1319,1398,1410,1415,"B400","B405","B406","B408","B410","B463","D400","D405","D406","D408","D410","D463","K400","K405","K406","K408","K410","K463","G400","G405","G406","G408","G410","G463",2201,1250,1251,1253,500,"500F",501,503,515,560,580,586,587,2530,2532,2534,2613,516,519,520,529,530,541,542,543,544,1304,1307,1380,1401,1413,1477,1482,"E204","E201","E203","E206","E207","E213","E214","E215","E219","E831","E832","E820","E821","E826","E931","E932","E935","E936","E920","E921","E926","E822","E837","E234","E850","E852","E855","E950","E295","E296","E297","SE65","E891","E892","E894","E896","E898","E624ST","E624UP","E823","E825","E680"]
["CARAT P1",1400,1463,1408,1480,1481,1483,1488,1405,1406,1407,1484,1312,1319,1410,1415,"K400","K405","K406","K408","K410","K463","G400","G405","G406","G408","G410","G463",2201,1250,1251,1253,500,"500F",515,580,516,519,520,529,530,541,542,543,544,1304,1307,1380,1401,1413,1477,1482,"E204","E201","E203","E206","E207","E213","E214","E215","E219","E831","E832","E820","E821","E826","E931","E932","E935","E936","E920","E921","E926","E822","E837","E234","E850","E852","E855","E950","E295","E296","E297","SE66","E891","E892","E894","E896","E898","E624ST","E624UP","E823","E825","E681"]
["2VE",3600,3663,3608,3680,3681,3683,3688,3689,3605,3606,3607,3684,3673,3612,3619,3610,3615,3601,3650,3651,3657,3652,3632,3603,3685,3660,3690,3616,3624,3656,3613,516,519,520,529,530,541,542,543,544,1304,1307,1380,1401,1413,1477,1482,"E204","E201","E203","E206","E207","E213","E214","E215","E219","E831","E832","E820","E821","E826","E931","E932","E935","E936","E920","E921","E926","E822","E837","E234","E850","E852","E855","E950","E295","E296","E297","SE37","E891","E892","E894","E896","E898","E624ST","E624UP","E823","E825","E682"]
["3VE",3600,3663,3608,3680,3681,3683,3688,3689,3605,3606,3607,3684,3673,3612,3619,3610,3615,"B300","B305","B306","B308","B310","B363","K360","K365","K366","K368","K361","K363","G360","G365","G366","G368","G361","G363",3601,3650,3651,3657,3652,3632,3603,3685,3660,3690,3616,3624,3656,3613,516,519,520,529,530,541,542,543,544,1304,1307,1380,1401,1413,1477,1482,"E204","E201","E203","E206","E207","E213","E214","E215","E219","E831","E832","E820","E821","E826","E931","E932","E935","E936","E920","E921","E926","E822","E837","E234","E850","E852","E855","E950","E295","E296","E297","SE36","E891","E892","E894","E896","E898","E624ST","E624UP","E823","E825","E680"]
["CARAT P3",3600,3663,3608,3680,3681,3683,3688,3605,3606,3607,3684,3612,3619,3610,3615,"K360","K365","K366","K368","K361","K363","G360","G365","G366","G368","G361","G363",3601,3650,3651,3657,3652,3632,3685,3690,516,519,520,529,530,541,542,543,544,1304,1307,1380,1401,1413,1477,1482,"E204","E201","E203","E206","E207","E213","E214","E215","E219","E831","E832","E820","E821","E826","E931","E932","E935","E936","E920","E921","E926","E822","E837","E234","E850","E852","E855","E950","E295","E296","E297","SE35","E891","E892","E894","E896","E898","E624ST","E624UP","E823","E825","E680"]
["WZ",2122,2163,2108,2178,2179,2180,2181,2183,2188,2189,2105,3606,2107,2184,2112,2119,2110,2115,2101,2150,2151,2157,2152,2132,2155,2103,2185,2160,2190,2154,2153,2116,2124,2156,2113,516,519,520,529,530,541,542,543,544,1304,1307,1380,1401,1413,1477,1482,"E204","E201","E203","E207","E213","E214","E215","E219","E831","E832","E820","E821","E826","E931","E932","E935","E936","E920","E921","E926","E822","E837","E234","E850","E852","E855","E950","E295","E296","E297","E241","E891","E892","E894","E896","E898","E624ST","E624UP","E823","E825","E680"]
["SI6",1399,1400,1463,1408,1478,1479,1480,1481,1483,1488,1489,1405,1406,1407,1484,1473,1312,1319,1398,1410,1415,"B400*","B405*","B406*","B408*","B410*","B463*","D400","D405","D406","D408","D410","D463","K400","K405","K406","K408","K410","K463","G400","G405","G406","G408","G410","G463",2201,1250,1251,1253,500,"500F",501,503,515,560,580,586,587,2530,2532,2534,2613,516,519,520,529,530,541,542,543,544,1304,1307,1380,1401,1413,1477,1482,1486,1487,"E204","E201","E203","E206","E207","E213","E214","E215","E219","E831","E832","E820","E821","E826","E931","E932","E935","E936","E920","E921","E926","E822","E837","E234","E850","E852","E855","E950","E295","E296","E297","SE66","E891","E892","E894","E896","E898","E624ST","E624UP","E823","E825","E681","M550*","M551*","M552*","M553*","M554*","M555*","M556*","M557*","M558*","M540","M541",null,null,null,null,"M550","M551*","M552*","M553*","M554*","M555*","M556*","M557*","M558*","M540","M541",null,null,null,null,null,null,null,null,null,null,null,null,null,null,null,null,null,null,null,null,null,"M551","M552","M553","M554","M555","M556","M557","M558","M540","M541"]
["2VS",3600,3663,3608,3680,3681,3683,3688,3689,3605,3606,3607,3684,3673,3612,3619,3610,3615,"D300","D305","D306","D308","D310","D363",3601,3650,3651,3657,3652,3632,3603,3685,3660,3690,3616,3624,3656,3613,516,519,520,529,530,541,542,543,544,1304,1307,1380,1401,1413,1477,1482,1486,1487,"E204","E201","E203","E206*","E207","E213","E214","E215","E219","E831","E832","E820","E821","E826","E931","E932","E935","E936","E920","E921","E926","E822","E837","E234","E850","E852","E855","E950","E295","E296","E297","SE36","E891","E892","E894","E896","E898","E624ST","E624UP","E823","E825","E680","M550*","M551*","M552*","M553*","M554*","M555*","M556*","M557*","M558*","M540","M541"]
["3VS",3600,3663,3608,3680,3681,3683,3688,3689,3605,3606,3607,3684,3673,3612,3619,3610,3615,"B300*","B305*","B306*","B308*","B310*","B363*","D300","D305","D306","D308","D310","D363","K360*","K365*","K366*","K368*","K361*","K363*","G360*","G365*","G366*","G368*","G361*","G363*",3601,3650,3651,3657,3652,3632,3603,3685,3660,3690,3616,3624,3656,3613,516,519,520,529,530,541,542,543,544,1304,1307,1380,1401,1413,1477,1482,1486,1487,"E204","E201","E203","E206*","E207","E213","E214","E215","E219","E831","E832","E820","E821","E826","E931","E932","E935","E936","E920","E921","E926","E822","E837","E234","E850","E852","E855","E950","E295","E296","E297","SE36","E891","E892","E894","E896","E898","E624ST","E624UP","E823","E825","E680","M550*","M551*","M552*","M553*","M554*","M555*","M556*","M557*","M558*","M540","M541"]
["CARAT S1",1400,1463,1408,1480,1481,1483,1488,1405,1406,1407,1484,1312,1319,1410,1415,"D400","D405","D406","D408","D410","D463","K400","K405","K406","K408","K410","K463","G400","G405","G406","G408","G410","G463",2201,1250,1251,1253,500,"500F",501,503,515,560,580,586,587,2530,2532,2534,2613,516,519,520,529,530,541,542,543,544,1304,1307,1380,1401,1413,1477,1482,"E204","E201","E203","E206","E207","E213","E214","E215","E219","E831","E832","E820","E821","E826","E931","E932","E935","E936","E920","E921","E926","E822","E837","E234","E850","E852","E855","E950","E295","E296","E297","SE65","E891","E892","E894","E896","E898","E624ST","E624UP","E823","E825","E680"]
["CARAT S3",3600,3663,3608,3680,3681,3683,3688,3605,3606,3607,3684,3612,3619,3610,3615,"D400","D405","D406","D408","D410","D463","K360","K365","K366","K368","K361","K363","G360","G365","G366","G368","G361","G363",3601,3650,3651,3657,3652,3632,3685,3690,516,519,520,529,530,541,542,543,544,1304,1307,1380,1401,1413,1477,1482,"E204","E201","E203","E206","E207","E213","E214","E215","E219","E831","E832","E820","E821","E826","E931","E932","E935","E936","E920","E921","E926","E822","E837","E234","E850","E852","E855","E950","E295","E296","E297","SE35","E891","E892","E894","E896","E898","E624ST","E624UP","E823","E825","E680"]
["CARAT S4",1400,1463,1408,1480,1481,1483,1488,1405,1406,1407,1484,1312,1319,1410,1415,"D300","D305","D306","D308","D310","D363",2201,1250,1251,1253,500,"500F",515,580,516,519,520,529,530,541,542,543,544,1304,1307,1380,1401,1413,1477,1482,"E204","E201","E203","E206","E207","E213","E214","E215","E219","E831","E832","E820","E821","E826","E931","E932","E935","E936","E920","E921","E926","E822","E837","E234","E850","E852","E855","E950","E295","E296","E297","SE66","E891","E892","E894","E896","E898","E624ST","E624UP","E823","E825","E681"]
["CARAT S5",3600,3663,3608,3680,3681,3683,3688,3605,3606,3607,3684,3612,3619,3610,3615,"D300","D305","D306","D308","D310","D363","K360","K365","K366","K368","K361","K363","G360","G365","G366","G368","G361","G363",3601,3650,3651,3657,3652,3632,3685,3690,516,519,520,529,530,541,542,543,544,1304,1307,1380,1401,1413,1477,1482,"E204","E201","E203","E206","E207","E213","E214","E215","E219","E831","E832","E820","E821","E826","E931","E932","E935","E936","E920","E921","E926","E822","E837","E234","E850","E852","E855","E950","E295","E296","E297","SE35","E891","E892","E894","E896","E898","E624ST","E624UP","E823","E825","E680"]